[PC-BSD Testing] (no subject)

Kris Moore kris at pcbsd.org
Wed Jun 19 05:55:54 PDT 2013


On 06/15/2013 16:32, nemysis wrote:
> Hello
>
> I have try to update PBI with AppCafe and have not worked, update for
> Firefox was stalled.
>
> From CLi
>
> First have reinstalled
>
> pkg install -f ca_root_nss
>
>
> ls -lh /usr/local/share/certs
> total 832
> -r--r--r--  1 root  wheel   773k  4 Apr 14:05 ca-root-nss.crt
>
>
> pbi_update --update-all
>
> Starting update of firefox-20.0-amd64 to 21.0_2...
> Trying update via patchfile...
>
> 06/15 21:32:05 [ERROR] Failed to load trusted CA certificates from no. Cause: error:02001002:system library:fopen:No such file or directory
>
> 06/15 21:32:05 [NOTICE] ServerStat file /home/user/.pcbsd-aria-stat loaded successfully.
> [#c8b4d6 0B/0B CN:1 DL:0B]                                                                                                                                    
> 06/15 21:32:06 [ERROR] CUID#6 - Download aborted. URI=https://pub.allbsd.org/pub/pcbsd/PBI/www/firefox/9/x64/firefox-20.0_to_21.0_2-amd64.pbp
> Exception: [AbstractCommand.cc:304] errorCode=3 URI=https://pub.allbsd.org/pub/pcbsd/PBI/www/firefox/9/x64/firefox-20.0_to_21.0_2-amd64.pbp
>   -> [HttpSkipResponseCommand.cc:211] errorCode=3 Resource not found
>  *** Download Progress Summary as of Sat Jun 15 21:33:05 2013 ***                                                                                             
> ==============================================================================================================================================================
> [#c8b4d6 0B/0B CN:1 DL:0B]
> FILE: /usr/pbi/.firefox-21.0_2-amd64.pbi
> --------------------------------------------------------------------------------------------------------------------------------------------------------------
>
> [#c8b4d6 0B/0B CN:1 DL:0B]                                                                                                                                    
> 06/15 21:33:07 [ERROR] CUID#7 - Download aborted. URI=http://mirrors.isc.org/pub/pcbsd/PBI/www/firefox/9/x64/firefox-20.0_to_21.0_2-amd64.pbp
> Exception: [AbstractCommand.cc:304] errorCode=1 URI=http://mirrors.isc.org/pub/pcbsd/PBI/www/firefox/9/x64/firefox-20.0_to_21.0_2-amd64.pbp
>   -> [SocketCore.cc:481] errorCode=1 Failed to connect to the host 2001:4f8:0:2::1e, cause: No route to host
>  *** Download Progress Summary as of Sat Jun 15 21:34:06 2013 *** 
>
> ==============================================================================================================================================================
> [#c8b4d6 0B/0B CN:1 DL:0B]
> FILE: /usr/pbi/.firefox-21.0_2-amd64.pbi
> --------------------------------------------------------------------------------------------------------------------------------------------------------------
>
>  *** Download Progress Summary as of Sat Jun 15 21:35:06 2013 ***                                                                                             
> ==============================================================================================================================================================
> [#c8b4d6 0B/0B CN:1 DL:0B]
> FILE: /usr/pbi/.firefox-21.0_2-amd64.pbi
> --------------------------------------------------------------------------------------------------------------------------------------------------------------
>
>  *** Download Progress Summary as of Sat Jun 15 21:36:07 2013 ***                                                                                             
> ==============================================================================================================================================================
> [#c8b4d6 0B/0B CN:1 DL:0B]
> FILE: /usr/pbi/.firefox-21.0_2-amd64.pbi
> --------------------------------------------------------------------------------------------------------------------------------------------------------------
>
>  *** Download Progress Summary as of Sat Jun 15 21:37:08 2013 ***                                                                                             
> ==============================================================================================================================================================
> [#c8b4d6 0B/0B CN:1 DL:0B]
> FILE: /usr/pbi/.firefox-21.0_2-amd64.pbi
> --------------------------------------------------------------------------------------------------------------------------------------------------------------
>
>  *** Download Progress Summary as of Sat Jun 15 21:38:08 2013 ***                                                                                             
> ==============================================================================================================================================================
> [#c8b4d6 0B/0B CN:1 DL:0B]
> FILE: /usr/pbi/.firefox-21.0_2-amd64.pbi
> --------------------------------------------------------------------------------------------------------------------------------------------------------------
>
> [#c8b4d6 0B/0B CN:1 DL:0B]                                                                                                                                    
> 06/15 21:38:10 [ERROR] CUID#8 - Download aborted. URI=http://mirrors.secution.com/pc-bsd/PBI/www/firefox/9/x64/firefox-20.0_to_21.0_2-amd64.pbp
> Exception: [AbstractCommand.cc:292] errorCode=2 Timeout.
>  *** Download Progress Summary as of Sat Jun 15 21:39:09 2013 ***                                                                                             
> ==============================================================================================================================================================
> [#c8b4d6 0B/0B CN:1 DL:0B]
> FILE: /usr/pbi/.firefox-21.0_2-amd64.pbi
> --------------------------------------------------------------------------------------------------------------------------------------------------------------
>
>  *** Download Progress Summary as of Sat Jun 15 21:42:23 2013 ***                                                                                             
> ==============================================================================================================================================================
> [#c8b4d6 0B/0B CN:1 DL:0B]
> FILE: /usr/pbi/.firefox-21.0_2-amd64.pbi
> --------------------------------------------------------------------------------------------------------------------------------------------------------------
>
> [#c8b4d6 0B/0B CN:1 DL:0B]
> ...
> 06/15 21:42:59 [ERROR] CUID#6 - Download aborted. URI=https://pub.allbsd.org/pub/pcbsd/PBI/www/firefox/9/x64/firefox-21.0_2-amd64.pbi
> Exception: [AbstractCommand.cc:304] errorCode=3 URI=https://pub.allbsd.org/pub/pcbsd/PBI/www/firefox/9/x64/firefox-21.0_2-amd64.pbi
>   -> [HttpSkipResponseCommand.cc:211] errorCode=3 Resource not found
> [#2c9a2b 0B/0B CN:1 DL:0B]                                                                                                                                    
> 06/15 21:43:00 [ERROR] CUID#8 - Download aborted. URI=http://mirror.corbina.net/pub/pcbsd/PBI/www/firefox/9/x64/firefox-21.0_2-amd64.pbi
> Exception: [AbstractCommand.cc:304] errorCode=3 URI=http://mirror.corbina.net/pub/pcbsd/PBI/www/firefox/9/x64/firefox-21.0_2-amd64.pbi
>   -> [HttpSkipResponseCommand.cc:211] errorCode=3 Resource not found
>  *** Download Progress Summary as of Sat Jun 15 21:43:58 2013 ***                                                                                             
> ==============================================================================================================================================================
> [#2c9a2b 73MiB/189MiB(38%) CN:5 DL:1.2MiB ETA:1m31s]
> FILE: /usr/pbi/.firefox-21.0_2-amd64.pbi
> --------------------------------------------------------------------------------------------------------------------------------------------------------------
>
>  *** Download Progress Summary as of Sat Jun 15 21:44:58 2013 ***                                                                                             
> ==============================================================================================================================================================
> [#2c9a2b 150MiB/189MiB(79%) CN:5 DL:1.2MiB ETA:30s]
> FILE: /usr/pbi/.firefox-21.0_2-amd64.pbi
> --------------------------------------------------------------------------------------------------------------------------------------------------------------
>
> [#2c9a2b 189MiB/189MiB(99%) CN:1 DL:0.9MiB]                                                                                                                   
> 06/15 21:45:32 [NOTICE] Download complete: /usr/pbi/.firefox-21.0_2-amd64.pbi
>
> 06/15 21:45:32 [NOTICE] ServerStat file /home/user/.pcbsd-aria-stat saved successfully.
>
> Download Results:
> gid   |stat|avg speed  |path/URI
> ======+====+===========+=======================================================
> 2c9a2b|OK  |   1.2MiB/s|/usr/pbi/.firefox-21.0_2-amd64.pbi
>
> Status Legend:
> (OK):download completed.
>  
> Removing old version...Done
> Installing new version...Done
>
>
> PC-BSD Servers are not all working.
>
>
> There are not pbp Versions for
>
> firefox-20.0_to_21.0_2-amd64.pbp
>
> xfe-1.34_to_1.34_1-amd64.pbp
>
> ftp ftp.pcbsd.org:/pub/mirror/PBI/www/firefox/9/x64> ls
> total 399511                         
> -rw-rw-r--  1 65534  65534  209468488 Apr  8 16:36 firefox-20.0-amd64.pbi
> -rw-rw-r--  1 65534  65534         65 Apr  8 16:36 firefox-20.0-amd64.pbi.sha256
> -rw-r--r--  1 3018   65534  199102231 Jun 12 14:54 firefox-21.0_2-amd64.pbi
> -rw-r--r--  1 3018   65534         65 Jun 12 14:41 firefox-21.0_2-amd64.pbi.sha256
>
>
> What is with message?
>
> Failed to load trusted CA certificates from no. Cause: error:02001002:system library:fopen:No such file or directory
>
>
> Regards,
> nemysis
> _______________________________________________
> Testing mailing list
> Testing at lists.pcbsd.org
> http://lists.pcbsd.org/mailman/listinfo/testing

Its a aria2 bug, I'll check the port and see what options it's missing :)

-- 
Kris Moore
PC-BSD Software
iXsystems



More information about the Testing mailing list