[Pbibuild] PBI-8 Autobuild (amd64): deskutils/calibre/

Build 8x64 root at build8x64.pcbsd.org
Fri Feb 24 10:59:02 PST 2012


PBI Autobuild results for module deskutils/calibre/:
Status: Failed

View Folder:
ftp://ftp.pcbsd.org/pub/pbioutgoing/x64/8/deskutils/calibre//

File listing:
-rw-r--r--  1 root  wheel     846965 Feb 24 10:58 build.log.bz2
-rw-r--r--  1 root  wheel          0 Feb  7 01:56 build.time
-rwxr-xr-x  1 root  wheel  240882480 Feb  7 01:56 calibre-0.8.37-amd64.pbi
-rw-r--r--  1 root  wheel         66 Feb 24 10:58 calibre-0.8.37-amd64.pbi.md5
-rw-r--r--  1 root  wheel         16 Feb  7 01:56 mdate

PBI MD5:
MD5 (calibre-0.8.37-amd64.pbi) = bf68a8515b6e0319474beff9454c8f8c


Last 50 lines of build.log
---------------------------------------------------
  CXX    Stream.lo
  CXX    strtok_r.lo
  CXX    UnicodeMap.lo
  CXX    UnicodeTypeTable.lo
  CXX    ViewerPreferences.lo
  CXX    XRef.lo
  CXX    PSOutputDev.lo
  CXX    TextOutputDev.lo
  CXX    PageLabelInfo.lo
  CXX    SecurityHandler.lo
  CXX    Sound.lo
  CXX    XpdfPluginAPI.lo
  CXXLD  libpoppler.la
  CXX    CairoFontEngine.lo
  CXX    CairoOutputDev.lo
UTF8.h:59: warning: 'int mapUCS2(Unicode, char*, int)' defined but not used
  CXX    CairoRescaleBox.lo
  CXXLD  libpoppler-cairo.la
  CXX    ArthurOutputDev.lo
  CXXLD  libpoppler-arthur.la
gmake[3]: Leaving directory `/usr/ports/graphics/poppler-qt4/work/poppler-0.18.4/poppler'
gmake[2]: Leaving directory `/usr/ports/graphics/poppler-qt4/work/poppler-0.18.4/poppler'
Making all in test
gmake[2]: Entering directory `/usr/ports/graphics/poppler-qt4/work/poppler-0.18.4/test'
  CXX    perf-test.o
  CXX    perf-test-preview-dummy.o
  CXXLD  perf-test
  CXX    pdf-fullrewrite.o
  CXXLD  pdf-fullrewrite
gmake[2]: Leaving directory `/usr/ports/graphics/poppler-qt4/work/poppler-0.18.4/test'
Making all in qt4
gmake[2]: Entering directory `/usr/ports/graphics/poppler-qt4/work/poppler-0.18.4/qt4'
Making all in src
gmake[3]: Entering directory `/usr/ports/graphics/poppler-qt4/work/poppler-0.18.4/qt4/src'
  GEN    poppler-optcontent.moc
-i: not found
gmake[3]: *** [poppler-optcontent.moc] Error 127
gmake[3]: Leaving directory `/usr/ports/graphics/poppler-qt4/work/poppler-0.18.4/qt4/src'
gmake[2]: *** [all-recursive] Error 1
gmake[2]: Leaving directory `/usr/ports/graphics/poppler-qt4/work/poppler-0.18.4/qt4'
gmake[1]: *** [all-recursive] Error 1
gmake[1]: Leaving directory `/usr/ports/graphics/poppler-qt4/work/poppler-0.18.4'
gmake: *** [all] Error 2
*** Error code 1

Stop in /usr/ports/graphics/poppler-qt4.
*** Error code 1

Stop in /usr/ports/deskutils/calibre.
ERROR: 2.1 Build failed of deskutils/calibre/!!!


More information about the Pbibuild mailing list