[Pbibuild] PBI-8 Autobuild (amd64): irc/konversation-kde4/

Build 8x64 root at build8x64.pcbsd.org
Sun Apr 8 08:02:28 PDT 2012


PBI Autobuild results for module irc/konversation-kde4/:
Status: Failed

View Folder:
ftp://ftp.pcbsd.org/pub/pbioutgoing/x64/8/irc/konversation-kde4//

File listing:
-rw-r--r--  1 root  wheel     747877 Apr  8 08:01 build.log.bz2
-rw-r--r--  1 root  wheel          0 Apr  6 09:21 build.time
-rw-r--r--  1 root  wheel          7 Feb 10  2010 dirstatus
-rwxr-xr-x  1 root  wheel  286350239 Mar  6  2011 konversation-1.3.1_2-amd64.pbi
-rw-r--r--  1 root  wheel         72 Apr  8 08:02 konversation-1.3.1_2-amd64.pbi.md5
-rw-r--r--  1 root  wheel         16 Mar  6  2011 mdate

PBI MD5:
MD5 (konversation-1.3.1_2-amd64.pbi) = 21ef74ca5ed6d6ad4138c22d7bbe3216


Last 50 lines of build.log
---------------------------------------------------
 CFLAGS='-O2 -pipe -fno-strict-aliasing -DUPD_SIGNAL=0 -I.  -I/usr/ports/print/ghostscript9/work/ghostscript-9.05/lcms/include  -I/usr/Programs/Konversation/include/libpng  -I/usr/ports/print/ghostscript9/work/ghostscript-9.05/openjpeg/libopenjpeg  -I/usr/ports/print/ghostscript9/work/ghostscript-9.05/openjpeg  -I/usr/Programs/Konversation/include -I/usr/Programs/Konversation/include/freetype2  -Wall -Wstrict-prototypes -Wundef -Wmissing-declarations -Wmissing-prototypes -Wwrite-strings -Wno-strict-aliasing -Wdeclaration-after-statement -fno-builtin -fno-common -DHAVE_STDINT_H=1 -DHAVE_SYS_TIME_H=1 -DGX_COLOR_INDEX_TYPE="unsigned long int" -O2 -pipe -fno-strict-aliasing -DUSE_LIBICONV_GNU -DUSE_LIBPAPER -I/usr/Programs/Konversation/include   -DGS_DEVS_SHARED -DGS_DEVS_SHARED_DIR=\"/usr/Programs/Konversation/lib/ghostscript/9.05\" ' prefix=/usr/Programs/Konversation\
 ./soobj/aux/echogs ./soobj/aux/genarch
gmake[2]: Entering directory `/usr/ports/print/ghostscript9/work/ghostscript-9.05'
gmake[2]: `soobj/aux/genarch' is up to date.
gmake[2]: Leaving directory `/usr/ports/print/ghostscript9/work/ghostscript-9.05'
gmake GS_XE=./sobin/libgs.so.9.05 DISPLAY_DEV=./soobj/display.dev STDIO_IMPLEMENTATION=c BUILDDIRPREFIX=so GENOPT='' LDFLAGS='-L/usr/Programs/Konversation/lib -L/usr/Programs/Konversation/lib -pthread -shared -Wl,-soname=libgs.so.9'\
 CFLAGS='-O2 -pipe -fno-strict-aliasing -fPIC -DUPD_SIGNAL=0 -I.  -I/usr/ports/print/ghostscript9/work/ghostscript-9.05/lcms/include  -I/usr/Programs/Konversation/include/libpng  -I/usr/ports/print/ghostscript9/work/ghostscript-9.05/openjpeg/libopenjpeg  -I/usr/ports/print/ghostscript9/work/ghostscript-9.05/openjpeg  -I/usr/Programs/Konversation/include -I/usr/Programs/Konversation/include/freetype2  -Wall -Wstrict-prototypes -Wundef -Wmissing-declarations -Wmissing-prototypes -Wwrite-strings -Wno-strict-aliasing -Wdeclaration-after-statement -fno-builtin -fno-common -DHAVE_STDINT_H=1 -DHAVE_SYS_TIME_H=1 -DGX_COLOR_INDEX_TYPE="unsigned long int" -O2 -pipe -fno-strict-aliasing -DUSE_LIBICONV_GNU -DUSE_LIBPAPER -I/usr/Programs/Konversation/include   -DGS_DEVS_SHARED -DGS_DEVS_SHARED_DIR=\"/usr/Programs/Konversation/lib/ghostscript/9.05\" '\
 prefix=/usr/Programs/Konversation
gmake[2]: Entering directory `/usr/ports/print/ghostscript9/work/ghostscript-9.05'
cc  -DHAVE_MKSTEMP   -DHAVE_FONTCONFIG -DHAVE_LIBIDN -DHAVE_SETLOCALE -DHAVE_SSE2 -DHAVE_DBUS   -O2 -pipe -fno-strict-aliasing -fPIC -DUPD_SIGNAL=0 -I.  -I/usr/ports/print/ghostscript9/work/ghostscript-9.05/lcms/include  -I/usr/Programs/Konversation/include/libpng  -I/usr/ports/print/ghostscript9/work/ghostscript-9.05/openjpeg/libopenjpeg  -I/usr/ports/print/ghostscript9/work/ghostscript-9.05/openjpeg  -I/usr/Programs/Konversation/include -I/usr/Programs/Konversation/include/freetype2  -Wall -Wstrict-prototypes -Wundef -Wmissing-declarations -Wmissing-prototypes -Wwrite-strings -Wno-strict-aliasing -Wdeclaration-after-statement -fno-builtin -fno-common -DHAVE_STDINT_H=1 -DHAVE_SYS_TIME_H=1 -DGX_COLOR_INDEX_TYPE="unsigned long int" -O2 -pipe -fno-strict-aliasing -DUSE_LIBICONV_GNU -DUSE_LIBPAPER -I/usr/Programs/Konversation/include   -DGS_DEVS_SHARED -DGS_DEVS_SHARED_DIR=\"/usr/Programs/Konversation/lib/ghostscript/9.05\"  -Ifreetype/include -DFT2_BUILD_LIBRARY -DDARWIN_NO_CA!
 RBON -DFT_CONFIG_OPTION_SYSTEM_ZLIB -o ./soobj/fttype1.o -c freetype/src/base/fttype1.c
In file included from freetype/include/freetype/internal/services/svpsinfo.h:23,
                 from freetype/src/base/fttype1.c:22:
freetype/include/freetype/internal/t1types.h:82: error: nested redefinition of 'enum T1_EncodingType_'
freetype/include/freetype/internal/t1types.h:82: error: redeclaration of 'enum T1_EncodingType_'
freetype/include/freetype/internal/t1types.h:83: error: redeclaration of enumerator 'T1_ENCODING_TYPE_NONE'
/usr/Programs/Konversation/include/freetype2/freetype/t1tables.h:508: error: previous definition of 'T1_ENCODING_TYPE_NONE' was here
freetype/include/freetype/internal/t1types.h:84: error: redeclaration of enumerator 'T1_ENCODING_TYPE_ARRAY'
/usr/Programs/Konversation/include/freetype2/freetype/t1tables.h:509: error: previous definition of 'T1_ENCODING_TYPE_ARRAY' was here
freetype/include/freetype/internal/t1types.h:85: error: redeclaration of enumerator 'T1_ENCODING_TYPE_STANDARD'
/usr/Programs/Konversation/include/freetype2/freetype/t1tables.h:510: error: previous definition of 'T1_ENCODING_TYPE_STANDARD' was here
freetype/include/freetype/internal/t1types.h:86: error: redeclaration of enumerator 'T1_ENCODING_TYPE_ISOLATIN1'
/usr/Programs/Konversation/include/freetype2/freetype/t1tables.h:511: error: previous definition of 'T1_ENCODING_TYPE_ISOLATIN1' was here
freetype/include/freetype/internal/t1types.h:89: error: redeclaration of enumerator 'T1_ENCODING_TYPE_EXPERT'
/usr/Programs/Konversation/include/freetype2/freetype/t1tables.h:514: error: previous definition of 'T1_ENCODING_TYPE_EXPERT' was here
freetype/include/freetype/internal/t1types.h:89: error: redefinition of typedef 'T1_EncodingType'
/usr/Programs/Konversation/include/freetype2/freetype/t1tables.h:514: error: previous declaration of 'T1_EncodingType' was here
gmake[2]: *** [soobj/fttype1.o] Error 1
gmake[2]: Leaving directory `/usr/ports/print/ghostscript9/work/ghostscript-9.05'
gmake[1]: *** [so-subtarget] Error 2
gmake[1]: Leaving directory `/usr/ports/print/ghostscript9/work/ghostscript-9.05'
gmake: *** [so] Error 2
*** Error code 1

Stop in /usr/ports/print/ghostscript9.
*** Error code 1

Stop in /usr/ports/graphics/ImageMagick.
*** Error code 1

Stop in /usr/ports/graphics/libdmtx.
*** Error code 1

Stop in /usr/ports/graphics/prison.
*** Error code 1

Stop in /usr/ports/deskutils/kdepimlibs4.
*** Error code 1

Stop in /usr/ports/irc/konversation-kde4.
ERROR: 2.1 Build failed of irc/konversation-kde4/!!!


More information about the Pbibuild mailing list