[Pbibuild] PBI-8 Autobuild (i386): math/grace/

Build 8x32 root at build8x32.pcbsd.org
Sat Sep 24 13:13:30 PDT 2011


PBI Autobuild results for module math/grace/:
Status: Failed

View Folder:
ftp://ftp.pcbsd.org/pub/pbioutgoing/x32/8/math/grace//

File listing:
-rw-r--r--  1 root  wheel  513374 Sep 24 13:13 build.log.bz2
-rw-r--r--  1 root  wheel       0 Sep 23 09:33 build.time

PBI MD5:



Last 50 lines of build.log
---------------------------------------------------
else rm -f ".deps/fftwf77.Tpo"; exit 1; \
fi
libtool: compile:  gcc46 -DHAVE_CONFIG_H -I. -I. -I. -I. -I./../fftw -I. -O2 -pipe -Wl,-rpath=/usr/Programs/Grace/lib/gcc46 -fno-strict-aliasing -MT fftwf77.lo -MD -MP -MF .deps/fftwf77.Tpo -c fftwf77.c  -fPIC -DPIC -o .libs/fftwf77.o
libtool: compile:  gcc46 -DHAVE_CONFIG_H -I. -I. -I. -I. -I./../fftw -I. -O2 -pipe -Wl,-rpath=/usr/Programs/Grace/lib/gcc46 -fno-strict-aliasing -MT fftwf77.lo -MD -MP -MF .deps/fftwf77.Tpo -c fftwf77.c -o fftwf77.o >/dev/null 2>&1
/bin/sh /usr/Programs/Grace/bin/libtool --mode=link gcc46  -O2 -pipe -Wl,-rpath=/usr/Programs/Grace/lib/gcc46 -fno-strict-aliasing  -Wl,-rpath=/usr/Programs/Grace/lib/gcc46 -o libfftw.la -rpath /usr/Programs/Grace/lib -version-info 2:7:0 fn_1.lo fn_2.lo fn_3.lo fn_4.lo fn_5.lo fn_6.lo fn_7.lo fn_8.lo fn_9.lo fn_10.lo fn_11.lo fn_12.lo fn_13.lo fn_14.lo fn_15.lo fn_16.lo fn_32.lo fn_64.lo ftw_2.lo ftw_3.lo ftw_4.lo ftw_5.lo ftw_6.lo ftw_7.lo ftw_8.lo ftw_9.lo ftw_10.lo ftw_16.lo ftw_32.lo ftw_64.lo fni_1.lo fni_2.lo fni_3.lo fni_4.lo fni_5.lo fni_6.lo fni_7.lo fni_8.lo fni_9.lo fni_10.lo fni_11.lo fni_12.lo fni_13.lo fni_14.lo fni_15.lo fni_16.lo fni_32.lo fni_64.lo ftwi_2.lo ftwi_3.lo ftwi_4.lo ftwi_5.lo ftwi_6.lo ftwi_7.lo ftwi_8.lo ftwi_9.lo ftwi_10.lo ftwi_16.lo ftwi_32.lo ftwi_64.lo timer.lo config.lo planner.lo twiddle.lo executor.lo generic.lo fftwnd.lo malloc.lo wisdom.lo wisdomio.lo putils.lo rader.lo fftwf77.lo  -lm 
libtool: link: cc -shared  -fPIC -DPIC  .libs/fn_1.o .libs/fn_2.o .libs/fn_3.o .libs/fn_4.o .libs/fn_5.o .libs/fn_6.o .libs/fn_7.o .libs/fn_8.o .libs/fn_9.o .libs/fn_10.o .libs/fn_11.o .libs/fn_12.o .libs/fn_13.o .libs/fn_14.o .libs/fn_15.o .libs/fn_16.o .libs/fn_32.o .libs/fn_64.o .libs/ftw_2.o .libs/ftw_3.o .libs/ftw_4.o .libs/ftw_5.o .libs/ftw_6.o .libs/ftw_7.o .libs/ftw_8.o .libs/ftw_9.o .libs/ftw_10.o .libs/ftw_16.o .libs/ftw_32.o .libs/ftw_64.o .libs/fni_1.o .libs/fni_2.o .libs/fni_3.o .libs/fni_4.o .libs/fni_5.o .libs/fni_6.o .libs/fni_7.o .libs/fni_8.o .libs/fni_9.o .libs/fni_10.o .libs/fni_11.o .libs/fni_12.o .libs/fni_13.o .libs/fni_14.o .libs/fni_15.o .libs/fni_16.o .libs/fni_32.o .libs/fni_64.o .libs/ftwi_2.o .libs/ftwi_3.o .libs/ftwi_4.o .libs/ftwi_5.o .libs/ftwi_6.o .libs/ftwi_7.o .libs/ftwi_8.o .libs/ftwi_9.o .libs/ftwi_10.o .libs/ftwi_16.o .libs/ftwi_32.o .libs/ftwi_64.o .libs/timer.o .libs/config.o .libs/planner.o .libs/twiddle.o .libs/executor.o .libs/gener!
 ic.o .libs/fftwnd.o .libs/malloc.o .libs/wisdom.o .libs/wisdomio.o .libs/putils.o .libs/rader.o .libs/fftwf77.o   -lm  -O2 -Wl,-rpath=/usr/Programs/Grace/lib/gcc46 -Wl,-rpath=/usr/Programs/Grace/lib/gcc46   -Wl,-soname -Wl,libfftw.so.2 -o .libs/libfftw.so.2
.libs/fn_3.o(.text.__i686.get_pc_thunk.bx+0x0): In function `__i686.get_pc_thunk.bx':
: multiple definition of `__i686.get_pc_thunk.bx'
/usr/lib/crtbeginS.o(.gnu.linkonce.t.__i686.get_pc_thunk.bx+0x0): first defined here
gmake[2]: *** [libfftw.la] Error 1
gmake[2]: Leaving directory `/usr/ports/math/fftw/work/fftw-2.1.5/fftw'
gmake[1]: *** [all] Error 2
gmake[1]: Leaving directory `/usr/ports/math/fftw/work/fftw-2.1.5/fftw'
gmake: *** [all-recursive] Error 1
*** Error code 1

Stop in /usr/ports/math/fftw.
*** Error code 1

Stop in /usr/ports/math/grace.
===>   grace-5.1.22_5 depends on executable: gmake - found
===>   grace-5.1.22_5 depends on file: /usr/Programs/Grace/libdata/pkgconfig/xpm.pc - found
===>   grace-5.1.22_5 depends on shared library: t1 - found
===>   grace-5.1.22_5 depends on shared library: jpeg.11 - found
===>   grace-5.1.22_5 depends on shared library: png.6 - found
===>   grace-5.1.22_5 depends on shared library: tiff.4 - found
===>   grace-5.1.22_5 depends on shared library: fftw.2 - not found
===>    Verifying install for fftw.2 in /usr/ports/math/fftw
===>  Building for fftw-2.1.5_6
Making all in fftw
gmake[1]: Entering directory `/usr/ports/math/fftw/work/fftw-2.1.5/fftw'
gmake  all-am
gmake[2]: Entering directory `/usr/ports/math/fftw/work/fftw-2.1.5/fftw'
/bin/sh /usr/Programs/Grace/bin/libtool --mode=link gcc46  -O2 -pipe -Wl,-rpath=/usr/Programs/Grace/lib/gcc46 -fno-strict-aliasing  -Wl,-rpath=/usr/Programs/Grace/lib/gcc46 -o libfftw.la -rpath /usr/Programs/Grace/lib -version-info 2:7:0 fn_1.lo fn_2.lo fn_3.lo fn_4.lo fn_5.lo fn_6.lo fn_7.lo fn_8.lo fn_9.lo fn_10.lo fn_11.lo fn_12.lo fn_13.lo fn_14.lo fn_15.lo fn_16.lo fn_32.lo fn_64.lo ftw_2.lo ftw_3.lo ftw_4.lo ftw_5.lo ftw_6.lo ftw_7.lo ftw_8.lo ftw_9.lo ftw_10.lo ftw_16.lo ftw_32.lo ftw_64.lo fni_1.lo fni_2.lo fni_3.lo fni_4.lo fni_5.lo fni_6.lo fni_7.lo fni_8.lo fni_9.lo fni_10.lo fni_11.lo fni_12.lo fni_13.lo fni_14.lo fni_15.lo fni_16.lo fni_32.lo fni_64.lo ftwi_2.lo ftwi_3.lo ftwi_4.lo ftwi_5.lo ftwi_6.lo ftwi_7.lo ftwi_8.lo ftwi_9.lo ftwi_10.lo ftwi_16.lo ftwi_32.lo ftwi_64.lo timer.lo config.lo planner.lo twiddle.lo executor.lo generic.lo fftwnd.lo malloc.lo wisdom.lo wisdomio.lo putils.lo rader.lo fftwf77.lo  -lm 
libtool: link: cc -shared  -fPIC -DPIC  .libs/fn_1.o .libs/fn_2.o .libs/fn_3.o .libs/fn_4.o .libs/fn_5.o .libs/fn_6.o .libs/fn_7.o .libs/fn_8.o .libs/fn_9.o .libs/fn_10.o .libs/fn_11.o .libs/fn_12.o .libs/fn_13.o .libs/fn_14.o .libs/fn_15.o .libs/fn_16.o .libs/fn_32.o .libs/fn_64.o .libs/ftw_2.o .libs/ftw_3.o .libs/ftw_4.o .libs/ftw_5.o .libs/ftw_6.o .libs/ftw_7.o .libs/ftw_8.o .libs/ftw_9.o .libs/ftw_10.o .libs/ftw_16.o .libs/ftw_32.o .libs/ftw_64.o .libs/fni_1.o .libs/fni_2.o .libs/fni_3.o .libs/fni_4.o .libs/fni_5.o .libs/fni_6.o .libs/fni_7.o .libs/fni_8.o .libs/fni_9.o .libs/fni_10.o .libs/fni_11.o .libs/fni_12.o .libs/fni_13.o .libs/fni_14.o .libs/fni_15.o .libs/fni_16.o .libs/fni_32.o .libs/fni_64.o .libs/ftwi_2.o .libs/ftwi_3.o .libs/ftwi_4.o .libs/ftwi_5.o .libs/ftwi_6.o .libs/ftwi_7.o .libs/ftwi_8.o .libs/ftwi_9.o .libs/ftwi_10.o .libs/ftwi_16.o .libs/ftwi_32.o .libs/ftwi_64.o .libs/timer.o .libs/config.o .libs/planner.o .libs/twiddle.o .libs/executor.o .libs/gener!
 ic.o .libs/fftwnd.o .libs/malloc.o .libs/wisdom.o .libs/wisdomio.o .libs/putils.o .libs/rader.o .libs/fftwf77.o   -lm  -O2 -Wl,-rpath=/usr/Programs/Grace/lib/gcc46 -Wl,-rpath=/usr/Programs/Grace/lib/gcc46   -Wl,-soname -Wl,libfftw.so.2 -o .libs/libfftw.so.2
.libs/fn_3.o(.text.__i686.get_pc_thunk.bx+0x0): In function `__i686.get_pc_thunk.bx':
: multiple definition of `__i686.get_pc_thunk.bx'
/usr/lib/crtbeginS.o(.gnu.linkonce.t.__i686.get_pc_thunk.bx+0x0): first defined here
gmake[2]: *** [libfftw.la] Error 1
gmake[2]: Leaving directory `/usr/ports/math/fftw/work/fftw-2.1.5/fftw'
gmake[1]: *** [all] Error 2
gmake[1]: Leaving directory `/usr/ports/math/fftw/work/fftw-2.1.5/fftw'
gmake: *** [all-recursive] Error 1
*** Error code 1

Stop in /usr/ports/math/fftw.
*** Error code 1

Stop in /usr/ports/math/grace.
ERROR: 2.1 Build failed of math/grace/!!!


More information about the Pbibuild mailing list