[Pbibuild] PBI-8 Autobuild (i386): devel/monodevelop/

Build 8x32 root at build8x32.pcbsd.org
Tue Oct 11 10:39:53 PDT 2011


PBI Autobuild results for module devel/monodevelop/:
Status: Failed

View Folder:
ftp://ftp.pcbsd.org/pub/pbioutgoing/x32/8/devel/monodevelop//

File listing:
-rw-r--r--  1 root  wheel     918742 Oct 11 10:39 build.log.bz2
-rw-r--r--  1 root  wheel          0 Oct 10 05:12 build.time
-rw-r--r--  1 root  wheel         16 Jun 13 07:06 mdate
-rwxr-xr-x  1 root  wheel  166067717 Jun 13 07:06 monodevelop-2.4.2-i386.pbi
-rw-r--r--  1 root  wheel         68 Oct 11 10:39 monodevelop-2.4.2-i386.pbi.md5

PBI MD5:
MD5 (monodevelop-2.4.2-i386.pbi) = 80a7d213a060c4d4ff6c60da3ff80c4e


Last 50 lines of build.log
---------------------------------------------------
gmake[3]: Leaving directory `/usr/ports/print/libgnomeprint/work/libgnomeprint-2.18.8/libgnomeprint/ttsubset'
Making all in .
gmake[3]: Entering directory `/usr/ports/print/libgnomeprint/work/libgnomeprint-2.18.8/libgnomeprint'
gmake[3]: Nothing to be done for `all-am'.
gmake[3]: Leaving directory `/usr/ports/print/libgnomeprint/work/libgnomeprint-2.18.8/libgnomeprint'
Making all in transports
gmake[3]: Entering directory `/usr/ports/print/libgnomeprint/work/libgnomeprint-2.18.8/libgnomeprint/transports'
gmake[3]: Nothing to be done for `all'.
gmake[3]: Leaving directory `/usr/ports/print/libgnomeprint/work/libgnomeprint-2.18.8/libgnomeprint/transports'
Making all in modules
gmake[3]: Entering directory `/usr/ports/print/libgnomeprint/work/libgnomeprint-2.18.8/libgnomeprint/modules'
Making all in cups
gmake[4]: Entering directory `/usr/ports/print/libgnomeprint/work/libgnomeprint-2.18.8/libgnomeprint/modules/cups'
/bin/sh /usr/ports/print/libgnomeprint/work/gnome-libtool --tag=CC   --mode=compile cc -DHAVE_CONFIG_H -I. -I../../.. -I../../.. -I../../../libgnomeprint/gpa -D_REENTRANT -I/usr/Programs/monodevelop/include/glib-2.0 -I/usr/Programs/monodevelop/include/libart-2.0 -I/usr/Programs/monodevelop/include/pango-1.0 -I/usr/Programs/monodevelop/include/freetype2 -I/usr/Programs/monodevelop/include -I/usr/Programs/monodevelop/include/libxml2   -I/usr/Programs/monodevelop/include/freetype2 -I/usr/Programs/monodevelop/include -DG_LOG_DOMAIN=\"GnomePrintCupsPlugin\" -D_REENTRANT -I/usr/Programs/monodevelop/include/glib-2.0   -I/usr/Programs/monodevelop/include -D_REENTRANT -I/usr/Programs/monodevelop/include/libgnomecups-1 -I/usr/Programs/monodevelop/include -I/usr/Programs/monodevelop/include/glib-2.0    -I/usr/Programs/monodevelop/include  -O2 -pipe -fno-strict-aliasing  -MT gnome-print-cups-transport.lo -MD -MP -MF .deps/gnome-print-cups-transport.Tpo -c -o gnome-print-cups-transport.l!
 o gnome-print-cups-transport.c
gnome-libtool: compile:  cc -DHAVE_CONFIG_H -I. -I../../.. -I../../.. -I../../../libgnomeprint/gpa -D_REENTRANT -I/usr/Programs/monodevelop/include/glib-2.0 -I/usr/Programs/monodevelop/include/libart-2.0 -I/usr/Programs/monodevelop/include/pango-1.0 -I/usr/Programs/monodevelop/include/freetype2 -I/usr/Programs/monodevelop/include -I/usr/Programs/monodevelop/include/libxml2 -I/usr/Programs/monodevelop/include/freetype2 -I/usr/Programs/monodevelop/include -DG_LOG_DOMAIN=\"GnomePrintCupsPlugin\" -D_REENTRANT -I/usr/Programs/monodevelop/include/glib-2.0 -I/usr/Programs/monodevelop/include -D_REENTRANT -I/usr/Programs/monodevelop/include/libgnomecups-1 -I/usr/Programs/monodevelop/include -I/usr/Programs/monodevelop/include/glib-2.0 -I/usr/Programs/monodevelop/include -O2 -pipe -fno-strict-aliasing -MT gnome-print-cups-transport.lo -MD -MP -MF .deps/gnome-print-cups-transport.Tpo -c gnome-print-cups-transport.c  -fPIC -DPIC -o .libs/gnome-print-cups-transport.o
gnome-print-cups-transport.c:59: error: expected specifier-qualifier-list before 'FILE'
gnome-print-cups-transport.c: In function 'gp_transport_cups_init':
gnome-print-cups-transport.c:128: error: 'GPTransportCups' has no member named 'file'
gnome-print-cups-transport.c: In function 'gp_transport_cups_finalize':
gnome-print-cups-transport.c:140: error: 'GPTransportCups' has no member named 'file'
gnome-print-cups-transport.c: In function 'gp_transport_cups_open':
gnome-print-cups-transport.c:194: error: 'GPTransportCups' has no member named 'file'
gnome-print-cups-transport.c:196: error: 'GPTransportCups' has no member named 'file'
gnome-print-cups-transport.c: In function 'gp_transport_cups_close':
gnome-print-cups-transport.c:238: error: 'GPTransportCups' has no member named 'file'
gnome-print-cups-transport.c:241: error: 'GPTransportCups' has no member named 'file'
gnome-print-cups-transport.c:245: error: 'GPTransportCups' has no member named 'file'
gnome-print-cups-transport.c: In function 'gp_transport_cups_write':
gnome-print-cups-transport.c:270: error: 'GPTransportCups' has no member named 'file'
gnome-print-cups-transport.c:276: warning: incompatible implicit declaration of built-in function 'fwrite'
gnome-print-cups-transport.c:276: error: 'GPTransportCups' has no member named 'file'
gmake[4]: *** [gnome-print-cups-transport.lo] Error 1
gmake[4]: Leaving directory `/usr/ports/print/libgnomeprint/work/libgnomeprint-2.18.8/libgnomeprint/modules/cups'
gmake[3]: *** [all-recursive] Error 1
gmake[3]: Leaving directory `/usr/ports/print/libgnomeprint/work/libgnomeprint-2.18.8/libgnomeprint/modules'
gmake[2]: *** [all-recursive] Error 1
gmake[2]: Leaving directory `/usr/ports/print/libgnomeprint/work/libgnomeprint-2.18.8/libgnomeprint'
gmake[1]: *** [all-recursive] Error 1
gmake[1]: Leaving directory `/usr/ports/print/libgnomeprint/work/libgnomeprint-2.18.8'
gmake: *** [all] Error 2
*** Error code 1

Stop in /usr/ports/print/libgnomeprint.
*** Error code 1

Stop in /usr/ports/x11-toolkits/gnome-sharp20.
*** Error code 1

Stop in /usr/ports/devel/monodevelop.
ERROR: 2.1 Build failed of devel/monodevelop/!!!


More information about the Pbibuild mailing list