[Pbibuild] PBI-8 Autobuild (amd64): www/chromium/

Build 8x64 root at build8x64.pcbsd.org
Thu Oct 6 05:00:02 PDT 2011


PBI Autobuild results for module www/chromium/:
Status: Failed

View Folder:
ftp://ftp.pcbsd.org/pub/pbioutgoing/x64/8/www/chromium//

File listing:
-rw-r--r--  1 root  wheel    637964 Oct  6 04:59 build.log.bz2
-rw-r--r--  1 root  wheel         0 Oct  5 10:26 build.time
-rwxr-xr-x  1 root  wheel  83971641 Oct  1 17:40 chromium-14.0.835.163_2-amd64.pbi
-rw-r--r--  1 root  wheel        75 Oct  6 04:59 chromium-14.0.835.163_2-amd64.pbi.md5
-rw-r--r--  1 root  wheel        16 Oct  1 17:40 mdate

PBI MD5:
MD5 (chromium-14.0.835.163_2-amd64.pbi) = b512c05d86f78084e38cff14ae834928


Last 50 lines of build.log
---------------------------------------------------
  CXX(target) out/Release/obj.target/browser/chrome/browser/ui/webui/print_preview_data_source.o
  CXX(target) out/Release/obj.target/browser/chrome/browser/ui/webui/print_preview_handler.o
chrome/browser/ui/webui/print_preview_handler.cc: In member function 'void PrintSystemTaskProxy::GetPrinterCapabilities(const std::string&)':
chrome/browser/ui/webui/print_preview_handler.cc:291: error: 'ppd_file_t' was not declared in this scope
chrome/browser/ui/webui/print_preview_handler.cc:291: error: 'ppd' was not declared in this scope
chrome/browser/ui/webui/print_preview_handler.cc:291: error: 'ppdOpenFile' was not declared in this scope
chrome/browser/ui/webui/print_preview_handler.cc:293: error: 'ppd_attr_t' was not declared in this scope
chrome/browser/ui/webui/print_preview_handler.cc:293: error: 'attr' was not declared in this scope
chrome/browser/ui/webui/print_preview_handler.cc:293: error: 'ppdFindAttr' was not declared in this scope
chrome/browser/ui/webui/print_preview_handler.cc:297: error: 'ppd_choice_t' was not declared in this scope
chrome/browser/ui/webui/print_preview_handler.cc:297: error: 'ch' was not declared in this scope
chrome/browser/ui/webui/print_preview_handler.cc:297: error: 'ppdFindMarkedChoice' was not declared in this scope
chrome/browser/ui/webui/print_preview_handler.cc:299: error: 'ppd_option_t' was not declared in this scope
chrome/browser/ui/webui/print_preview_handler.cc:299: error: 'option' was not declared in this scope
chrome/browser/ui/webui/print_preview_handler.cc:299: error: 'ppdFindOption' was not declared in this scope
chrome/browser/ui/webui/print_preview_handler.cc:301: error: 'ppdFindChoice' was not declared in this scope
chrome/browser/ui/webui/print_preview_handler.cc:307: error: 'ppdClose' was not declared in this scope
  CXX(target) out/Release/obj.target/browser/chrome/browser/ui/webui/print_preview_ui.o
gmake: *** [out/Release/obj.target/browser/chrome/browser/ui/webui/print_preview_handler.o] Error 1
gmake: *** Waiting for unfinished jobs....
*** Error code 1

Stop in /usr/ports/www/chromium.
===>  Building for chromium-14.0.835.202
  ACTION Extracting last change to /usr/ports/www/chromium/work/chromium-courgette-redacted-14.0.835.202/out/Release/obj/gen/build/LASTCHANGE out/Release/obj/gen/build/LASTCHANGE.always
  AR(target) out/Release/obj.target/third_party/WebKit/Source/WebKit/chromium/libwebkit.a
  CXX(target) out/Release/obj.target/browser/chrome/browser/ui/webui/print_preview_handler.o
  CXX(target) out/Release/obj.target/browser/chrome/browser/ui/webui/quota_internals_handler.o
chrome/browser/ui/webui/print_preview_handler.cc: In member function 'void PrintSystemTaskProxy::GetPrinterCapabilities(const std::string&)':
chrome/browser/ui/webui/print_preview_handler.cc:291: error: 'ppd_file_t' was not declared in this scope
chrome/browser/ui/webui/print_preview_handler.cc:291: error: 'ppd' was not declared in this scope
chrome/browser/ui/webui/print_preview_handler.cc:291: error: 'ppdOpenFile' was not declared in this scope  CXX(target) out/Release/obj.target/browser/chrome/browser/ui/webui/quota_internals_proxy.o

chrome/browser/ui/webui/print_preview_handler.cc:293: error: 'ppd_attr_t' was not declared in this scope
chrome/browser/ui/webui/print_preview_handler.cc:293: error: 'attr' was not declared in this scope
chrome/browser/ui/webui/print_preview_handler.cc:293: error: 'ppdFindAttr' was not declared in this scope
chrome/browser/ui/webui/print_preview_handler.cc:297: error: 'ppd_choice_t' was not declared in this scope
chrome/browser/ui/webui/print_preview_handler.cc:297: error: 'ch' was not declared in this scope
chrome/browser/ui/webui/print_preview_handler.cc:297: error: 'ppdFindMarkedChoice' was not declared in this scope
chrome/browser/ui/webui/print_preview_handler.cc:299: error: 'ppd_option_t' was not declared in this scope
chrome/browser/ui/webui/print_preview_handler.cc:299: error: 'option' was not declared in this scope
chrome/browser/ui/webui/print_preview_handler.cc:299: error: 'ppdFindOption' was not declared in this scope
chrome/browser/ui/webui/print_preview_handler.cc:301: error: 'ppdFindChoice' was not declared in this scope
chrome/browser/ui/webui/print_preview_handler.cc:307: error: 'ppdClose' was not declared in this scope
gmake: *** [out/Release/obj.target/browser/chrome/browser/ui/webui/print_preview_handler.o] Error 1
gmake: *** Waiting for unfinished jobs....
*** Error code 1

Stop in /usr/ports/www/chromium.
ERROR: 2.1 Build failed of www/chromium/!!!


More information about the Pbibuild mailing list