[Pbibuild] PBI-8 Autobuild (i386): games/darkplaces/

Build 8x32 root at build8x32.pcbsd.org
Fri Nov 25 05:49:03 PST 2011


PBI Autobuild results for module games/darkplaces/:
Status: Failed

View Folder:
ftp://ftp.pcbsd.org/pub/pbioutgoing/x32/8/games/darkplaces//

File listing:
-rw-r--r--  1 root  wheel    193823 Nov 25 05:49 build.log.bz2
-rw-r--r--  1 root  wheel         0 Nov 24 06:23 build.time
-rwxr-xr-x  1 root  wheel  14482846 Jun 22 11:51 darkplaces-20071120_5-i386.pbi
-rw-r--r--  1 root  wheel        72 Nov 25 05:49 darkplaces-20071120_5-i386.pbi.md5
-rw-r--r--  1 root  wheel        16 Jun 22 11:51 mdate

PBI MD5:
MD5 (darkplaces-20071120_5-i386.pbi) = 23b33fc7e4c248089eeee4b8c5bd2a5d


Last 50 lines of build.log
---------------------------------------------------
                 from quakedef.h:387,
                 from zone.c:22:
prvm_offsets.h:812:38: warning: no newline at end of file
In file included from progsvm.h:359,
                 from quakedef.h:387,
                 from zone.c:22:
prvm_offsets.h:812:38: warning: no newline at end of file
In file included from progsvm.h:438,
                 from quakedef.h:387,
                 from zone.c:22:
prvm_offsets.h:812:38: warning: no newline at end of file
cc -o darkplaces-glx builddate.c sys_linux.o vid_glx.o thread_pthread.o keysym2ucs.o snd_main.o snd_mem.o snd_mix.o snd_ogg.o snd_wav.o snd_modplug.o snd_oss.o cd_bsd.o bih.o cap_avi.o cap_ogg.o cd_shared.o crypto.o cl_collision.o cl_demo.o cl_dyntexture.o cl_gecko.o cl_input.o cl_main.o cl_parse.o cl_particles.o cl_screen.o cl_video.o clvm_cmds.o cmd.o collision.o common.o console.o csprogs.o curves.o cvar.o dpsoftrast.o dpvsimpledecode.o filematch.o fractalnoise.o fs.o ft2.o utf8lib.o gl_backend.o gl_draw.o gl_rmain.o gl_rsurf.o gl_textures.o hmac.o host.o host_cmd.o image.o image_png.o jpeg.o keys.o lhnet.o libcurl.o mathlib.o matrixlib.o mdfour.o menu.o meshqueue.o mod_skeletal_animatevertices_sse.o mod_skeletal_animatevertices_generic.o model_alias.o model_brush.o model_shared.o model_sprite.o mvm_cmds.o netconn.o palette.o polygon.o portals.o protocol.o prvm_cmds.o prvm_edict.o prvm_exec.o r_explosion.o r_lerpanim.o r_lightning.o r_modules.o r_shadow.o r_sky.o r_sprite!
 s.o sbar.o sv_demo.o sv_main.o sv_move.o sv_phys.o sv_user.o svbsp.o svvm_cmds.o sys_shared.o vid_shared.o view.o wad.o world.o zone.o  -fno-math-errno -ffinite-math-only -fno-rounding-math -fno-signaling-nans -fno-trapping-math -DSVNREVISION=- -DBUILDTYPE=release -lm      -lutil -L/usr/Programs/darkplaces/lib -lX11 -lXpm -lXext -lXxf86dga -lXxf86vm -pthread 
dpsoftrast.o(.text+0x245d): In function `DPSOFTRAST_Draw_InterpretCommands':
: undefined reference to `__sync_add_and_fetch_4'
dpsoftrast.o(.text+0x366d): In function `DPSOFTRAST_Draw_InterpretCommands':
: undefined reference to `__sync_add_and_fetch_4'
gmake[2]: *** [darkplaces-glx] Error 1
gmake[2]: Leaving directory `/usr/ports/games/darkplaces/work/darkplaces'
gmake[1]: *** [bin-release] Error 2
gmake[1]: Leaving directory `/usr/ports/games/darkplaces/work/darkplaces'
gmake: *** [cl-release] Error 2
*** Error code 1

Stop in /usr/ports/games/darkplaces.
===>  Building for darkplaces-20110628
gmake bin-release \
	DP_MAKE_TARGET=bsd DP_SOUND_API=OSS \
	EXE="darkplaces-glx" LDFLAGS_COMMON="-lm `[ -n "" ] && "/../bin/ode-config" --libs` `[ -n "" ] && echo -lstdc++` "" `[ -n "" ] && echo \ /libd0_blind_id.a\ /libgmp.a` `[ -n "" ] && echo \ /libd0_rijndael.a` -lutil -L/usr/Programs/darkplaces/lib -lX11 -lXpm -lXext -lXxf86dga -lXxf86vm -pthread `[ -n "" ] && echo \ /libmodplug.a\ -lstdc++`" LEVEL=1
gmake[1]: Entering directory `/usr/ports/games/darkplaces/work/darkplaces'

========== darkplaces-glx (release) ==========
gmake darkplaces-glx \
	DP_MAKE_TARGET=bsd DP_SOUND_API=OSS \
	CFLAGS+="-MMD  -DDP_FS_BASEDIR='\"/usr/Programs/darkplaces/share/quake\"' -Wall -Wold-style-definition -Wstrict-prototypes -Wsign-compare -Wdeclaration-after-statement ""  -D_FILE_OFFSET_BITS=64 -D__KERNEL_STRICT_NAMES   -fno-math-errno -ffinite-math-only -fno-rounding-math -fno-signaling-nans -fno-trapping-math"\
	LDFLAGS+="-fno-math-errno -ffinite-math-only -fno-rounding-math -fno-signaling-nans -fno-trapping-math -DSVNREVISION=`{ test -d .svn && svnversion; } || { test -d .git && git describe --always; } || echo -` -DBUILDTYPE=release -lm      -lutil -L/usr/Programs/darkplaces/lib -lX11 -lXpm -lXext -lXxf86dga -lXxf86vm -pthread " LEVEL=2
gmake[2]: Entering directory `/usr/ports/games/darkplaces/work/darkplaces'
cc -o darkplaces-glx builddate.c sys_linux.o vid_glx.o thread_pthread.o keysym2ucs.o snd_main.o snd_mem.o snd_mix.o snd_ogg.o snd_wav.o snd_modplug.o snd_oss.o cd_bsd.o bih.o cap_avi.o cap_ogg.o cd_shared.o crypto.o cl_collision.o cl_demo.o cl_dyntexture.o cl_gecko.o cl_input.o cl_main.o cl_parse.o cl_particles.o cl_screen.o cl_video.o clvm_cmds.o cmd.o collision.o common.o console.o csprogs.o curves.o cvar.o dpsoftrast.o dpvsimpledecode.o filematch.o fractalnoise.o fs.o ft2.o utf8lib.o gl_backend.o gl_draw.o gl_rmain.o gl_rsurf.o gl_textures.o hmac.o host.o host_cmd.o image.o image_png.o jpeg.o keys.o lhnet.o libcurl.o mathlib.o matrixlib.o mdfour.o menu.o meshqueue.o mod_skeletal_animatevertices_sse.o mod_skeletal_animatevertices_generic.o model_alias.o model_brush.o model_shared.o model_sprite.o mvm_cmds.o netconn.o palette.o polygon.o portals.o protocol.o prvm_cmds.o prvm_edict.o prvm_exec.o r_explosion.o r_lerpanim.o r_lightning.o r_modules.o r_shadow.o r_sky.o r_sprite!
 s.o sbar.o sv_demo.o sv_main.o sv_move.o sv_phys.o sv_user.o svbsp.o svvm_cmds.o sys_shared.o vid_shared.o view.o wad.o world.o zone.o  -fno-math-errno -ffinite-math-only -fno-rounding-math -fno-signaling-nans -fno-trapping-math -DSVNREVISION=- -DBUILDTYPE=release -lm      -lutil -L/usr/Programs/darkplaces/lib -lX11 -lXpm -lXext -lXxf86dga -lXxf86vm -pthread 
dpsoftrast.o(.text+0x245d): In function `DPSOFTRAST_Draw_InterpretCommands':
: undefined reference to `__sync_add_and_fetch_4'
dpsoftrast.o(.text+0x366d): In function `DPSOFTRAST_Draw_InterpretCommands':
: undefined reference to `__sync_add_and_fetch_4'
gmake[2]: *** [darkplaces-glx] Error 1
gmake[2]: Leaving directory `/usr/ports/games/darkplaces/work/darkplaces'
gmake[1]: *** [bin-release] Error 2
gmake[1]: Leaving directory `/usr/ports/games/darkplaces/work/darkplaces'
gmake: *** [cl-release] Error 2
*** Error code 1

Stop in /usr/ports/games/darkplaces.
ERROR: 2.1 Build failed of games/darkplaces/!!!


More information about the Pbibuild mailing list