[Pbibuild] PBI-8 Autobuild (amd64): graphics/lightspark-devel/

Build 8x64 root at build8x64.pcbsd.org
Tue Mar 29 22:16:10 PDT 2011


PBI Autobuild results for module graphics/lightspark-devel/:
Status: Failed

View Folder:
ftp://ftp.pcbsd.org/pub/pbioutgoing/x64/8/graphics/lightspark-devel//

File listing:
-rw-r--r--  1 root  wheel    1469498 Mar 29 22:15 build.log.bz2
-rw-r--r--  1 root  wheel          0 Mar 29 01:13 build.time
-rwxr-xr-x  1 root  wheel  135492952 Mar 13 20:50 lightspark-devel-r20110309-amd64.pbi
-rw-r--r--  1 root  wheel         78 Mar 29 22:15 lightspark-devel-r20110309-amd64.pbi.md5
-rw-r--r--  1 root  wheel         16 Mar 13 20:50 mdate

PBI MD5:
MD5 (lightspark-devel-r20110309-amd64.pbi) = 6feffd63504da8a0c86edcb33757f954


Last 50 lines of build.log
---------------------------------------------------
make -f CMakeFiles/spark.dir/build.make CMakeFiles/spark.dir/build
/Programs/lightspark-devel/bin/cmake -E cmake_progress_report /usr/ports/graphics/lightspark-devel/work/lightspark/CMakeFiles 10
/Programs/lightspark-devel/bin/cmake -E cmake_progress_report /usr/ports/graphics/lightspark-devel/work/lightspark/CMakeFiles 11
[  7%] [  7%] Building CXX object CMakeFiles/spark.dir/compat.cpp.o
/usr/local/bin/g++45   -Dspark_EXPORTS -DVERSION=\"0.4.5.3\" -DSHORTVERSION=\"453\" -DLLVM_28 -DHAVE_AVCODEC_DECODE_VIDEO2 -DHAVE_AVCODEC_DECODE_AUDIO3 -DENABLE_LIBAVCODEC -DMOZ_X11 -DCOMPILE_PLUGIN -DENABLE_CURL -DDATADIR=\"/Programs/lightspark-devel/share/lightspark\" -DGNASH_PATH=\"/usr/bin/gnash\" -DPRIVATELIBDIR=\"/Programs/lightspark-devel/lib/lightspark\" -DHAVE_ATOMIC -O2 -pipe -Wl,-rpath=/Programs/lightspark-devel/lib/gcc45 -fno-strict-aliasing -I/Programs/lightspark-devel/include/firefox3 -Wall -Wnon-virtual-dtor -Woverloaded-virtual -pipe -fvisibility=hidden -fvisibility-inlines-hidden -std=c++0x -Wdisabled-optimization -g -O2 -DNDEBUG -fPIC -I/Programs/lightspark-devel/include -I/Programs/lightspark-devel/include/SDL -I/Programs/lightspark-devel/include/freetype2 -I/Programs/lightspark-devel/include/libxml++-2.6 -I/Programs/lightspark-devel/include/libxml++-2.6/include -I/Programs/lightspark-devel/include/libxml2 -I/Programs/lightspark-devel/include/glibmm-2.4 -I!
 /Programs/lightspark-devel/lib/glibmm-2.4/include -I/Programs/lightspark-devel/include/sigc++-2.0 -I/Programs/lightspark-devel/lib/sigc++-2.0/include -I/Programs/lightspark-devel/include/glib-2.0 -I/Programs/lightspark-devel/lib/glib-2.0/include -I/Programs/lightspark-devel/include/cairo -I/Programs/lightspark-devel/include/pixman-1 -I/Programs/lightspark-devel/include/gtk-2.0 -I/Programs/lightspark-devel/lib/gtk-2.0/include -I/Programs/lightspark-devel/include/atk-1.0 -I/Programs/lightspark-devel/include/gdk-pixbuf-2.0 -I/Programs/lightspark-devel/include/pango-1.0 -I/Programs/lightspark-devel/include/gio-unix-2.0 -I/usr/ports/graphics/lightspark-devel/work/lightspark -o CMakeFiles/spark.dir/compat.cpp.o -c /usr/ports/graphics/lightspark-devel/work/lightspark/compat.cpp
Building CXX object CMakeFiles/spark.dir/asobject.cpp.o
/usr/local/bin/g++45   -Dspark_EXPORTS -DVERSION=\"0.4.5.3\" -DSHORTVERSION=\"453\" -DLLVM_28 -DHAVE_AVCODEC_DECODE_VIDEO2 -DHAVE_AVCODEC_DECODE_AUDIO3 -DENABLE_LIBAVCODEC -DMOZ_X11 -DCOMPILE_PLUGIN -DENABLE_CURL -DDATADIR=\"/Programs/lightspark-devel/share/lightspark\" -DGNASH_PATH=\"/usr/bin/gnash\" -DPRIVATELIBDIR=\"/Programs/lightspark-devel/lib/lightspark\" -DHAVE_ATOMIC -O2 -pipe -Wl,-rpath=/Programs/lightspark-devel/lib/gcc45 -fno-strict-aliasing -I/Programs/lightspark-devel/include/firefox3 -Wall -Wnon-virtual-dtor -Woverloaded-virtual -pipe -fvisibility=hidden -fvisibility-inlines-hidden -std=c++0x -Wdisabled-optimization -g -O2 -DNDEBUG -fPIC -I/Programs/lightspark-devel/include -I/Programs/lightspark-devel/include/SDL -I/Programs/lightspark-devel/include/freetype2 -I/Programs/lightspark-devel/include/libxml++-2.6 -I/Programs/lightspark-devel/include/libxml++-2.6/include -I/Programs/lightspark-devel/include/libxml2 -I/Programs/lightspark-devel/include/glibmm-2.4 -I!
 /Programs/lightspark-devel/lib/glibmm-2.4/include -I/Programs/lightspark-devel/include/sigc++-2.0 -I/Programs/lightspark-devel/lib/sigc++-2.0/include -I/Programs/lightspark-devel/include/glib-2.0 -I/Programs/lightspark-devel/lib/glib-2.0/include -I/Programs/lightspark-devel/include/cairo -I/Programs/lightspark-devel/include/pixman-1 -I/Programs/lightspark-devel/include/gtk-2.0 -I/Programs/lightspark-devel/lib/gtk-2.0/include -I/Programs/lightspark-devel/include/atk-1.0 -I/Programs/lightspark-devel/include/gdk-pixbuf-2.0 -I/Programs/lightspark-devel/include/pango-1.0 -I/Programs/lightspark-devel/include/gio-unix-2.0 -I/usr/ports/graphics/lightspark-devel/work/lightspark -o CMakeFiles/spark.dir/asobject.cpp.o -c /usr/ports/graphics/lightspark-devel/work/lightspark/asobject.cpp
/Programs/lightspark-devel/bin/cmake -E cmake_progress_report /usr/ports/graphics/lightspark-devel/work/lightspark/CMakeFiles 12
[  9%] Building CXX object CMakeFiles/spark.dir/frame.cpp.o
/usr/local/bin/g++45   -Dspark_EXPORTS -DVERSION=\"0.4.5.3\" -DSHORTVERSION=\"453\" -DLLVM_28 -DHAVE_AVCODEC_DECODE_VIDEO2 -DHAVE_AVCODEC_DECODE_AUDIO3 -DENABLE_LIBAVCODEC -DMOZ_X11 -DCOMPILE_PLUGIN -DENABLE_CURL -DDATADIR=\"/Programs/lightspark-devel/share/lightspark\" -DGNASH_PATH=\"/usr/bin/gnash\" -DPRIVATELIBDIR=\"/Programs/lightspark-devel/lib/lightspark\" -DHAVE_ATOMIC -O2 -pipe -Wl,-rpath=/Programs/lightspark-devel/lib/gcc45 -fno-strict-aliasing -I/Programs/lightspark-devel/include/firefox3 -Wall -Wnon-virtual-dtor -Woverloaded-virtual -pipe -fvisibility=hidden -fvisibility-inlines-hidden -std=c++0x -Wdisabled-optimization -g -O2 -DNDEBUG -fPIC -I/Programs/lightspark-devel/include -I/Programs/lightspark-devel/include/SDL -I/Programs/lightspark-devel/include/freetype2 -I/Programs/lightspark-devel/include/libxml++-2.6 -I/Programs/lightspark-devel/include/libxml++-2.6/include -I/Programs/lightspark-devel/include/libxml2 -I/Programs/lightspark-devel/include/glibmm-2.4 -I!
 /Programs/lightspark-devel/lib/glibmm-2.4/include -I/Programs/lightspark-devel/include/sigc++-2.0 -I/Programs/lightspark-devel/lib/sigc++-2.0/include -I/Programs/lightspark-devel/include/glib-2.0 -I/Programs/lightspark-devel/lib/glib-2.0/include -I/Programs/lightspark-devel/include/cairo -I/Programs/lightspark-devel/include/pixman-1 -I/Programs/lightspark-devel/include/gtk-2.0 -I/Programs/lightspark-devel/lib/gtk-2.0/include -I/Programs/lightspark-devel/include/atk-1.0 -I/Programs/lightspark-devel/include/gdk-pixbuf-2.0 -I/Programs/lightspark-devel/include/pango-1.0 -I/Programs/lightspark-devel/include/gio-unix-2.0 -I/usr/ports/graphics/lightspark-devel/work/lightspark -o CMakeFiles/spark.dir/frame.cpp.o -c /usr/ports/graphics/lightspark-devel/work/lightspark/frame.cpp
In file included from /usr/local/include/llvm/Support/Allocator.h:17:0,
                 from /usr/local/include/llvm/ADT/StringMap.h:18,
                 from /usr/local/include/llvm/PassRegistry.h:20,
                 from /usr/local/include/llvm/PassSupport.h:25,
                 from /usr/local/include/llvm/Pass.h:366,
                 from /usr/local/include/llvm/PassManager.h:20,
                 from /usr/ports/graphics/lightspark-devel/work/lightspark/scripting/abc.h:27,
                 from /usr/ports/graphics/lightspark-devel/work/lightspark/frame.cpp:20:
/usr/local/include/llvm/Support/AlignOf.h:57:24: error: expected unqualified-id before 'alignof'
In file included from /usr/local/include/llvm/ADT/StringMap.h:18:0,
                 from /usr/local/include/llvm/PassRegistry.h:20,
                 from /usr/local/include/llvm/PassSupport.h:25,
                 from /usr/local/include/llvm/Pass.h:366,
                 from /usr/local/include/llvm/PassManager.h:20,
                 from /usr/ports/graphics/lightspark-devel/work/lightspark/scripting/abc.h:27,
                 from /usr/ports/graphics/lightspark-devel/work/lightspark/frame.cpp:20:
/usr/local/include/llvm/Support/Allocator.h: In member function 'void llvm::SpecificBumpPtrAllocator<T>::DestroyAll()':
/usr/local/include/llvm/Support/Allocator.h:204:46: error: expected primary-expression before '<' token
/usr/local/include/llvm/Support/Allocator.h:204:48: error: expected primary-expression before '>' token
/usr/local/include/llvm/Support/Allocator.h:204:50: error: expected primary-expression before ')' token
In file included from /usr/local/include/llvm/PassRegistry.h:20:0,
                 from /usr/local/include/llvm/PassSupport.h:25,
                 from /usr/local/include/llvm/Pass.h:366,
                 from /usr/local/include/llvm/PassManager.h:20,
                 from /usr/ports/graphics/lightspark-devel/work/lightspark/scripting/abc.h:27,
                 from /usr/ports/graphics/lightspark-devel/work/lightspark/frame.cpp:20:
/usr/local/include/llvm/ADT/StringMap.h: In static member function 'static llvm::StringMapEntry<ValueTy>* llvm::StringMapEntry<ValueTy>::Create(const char*, const char*, AllocatorTy&, InitType)':
/usr/local/include/llvm/ADT/StringMap.h:170:33: error: expected primary-expression before '<' token
/usr/local/include/llvm/ADT/StringMap.h:170:48: error: expected primary-expression before '>' token
/usr/local/include/llvm/ADT/StringMap.h:170:50: error: expected primary-expression before ')' token
*** Error code 1
1 error
*** Error code 2
1 error
*** Error code 2
1 error
*** Error code 1

Stop in /usr/ports/graphics/lightspark-devel.
ERROR: 2.1 Build failed of graphics/lightspark-devel/!!!


More information about the Pbibuild mailing list