[Pbibuild] PBI-8 Autobuild (i386): graphics/lightspark-devel/

Build 8x32 root at build8x32.pcbsd.org
Mon Mar 28 09:19:11 PDT 2011


PBI Autobuild results for module graphics/lightspark-devel/:
Status: Failed

View Folder:
ftp://ftp.pcbsd.org/pub/pbioutgoing/x32/8/graphics/lightspark-devel//

File listing:
-rw-r--r--  1 root  wheel    1439099 Mar 28 09:18 build.log.bz2
-rw-r--r--  1 root  wheel          0 Mar 25 07:33 build.time
-rwxr-xr-x  1 root  wheel  130615764 Mar 12 16:18 lightspark-devel-r20110309-i386.pbi
-rw-r--r--  1 root  wheel         77 Mar 28 09:18 lightspark-devel-r20110309-i386.pbi.md5
-rw-r--r--  1 root  wheel         16 Mar 12 16:18 mdate

PBI MD5:
MD5 (lightspark-devel-r20110309-i386.pbi) = 761292b6c864a5abdf8d05b3a30539a1


Last 50 lines of build.log
---------------------------------------------------
                 from /usr/local/include/llvm/PassSupport.h:25,
                 from /usr/local/include/llvm/Pass.h:366,
                 from /usr/local/include/llvm/PassManager.h:20,
                 from /usr/ports/graphics/lightspark-devel/work/lightspark/scripting/abc.h:27,
                 from /usr/ports/graphics/lightspark-devel/work/lightspark/frame.cpp:20:
/usr/local/include/llvm/ADT/StringMap.h: In static member function 'static llvm::StringMapEntry<ValueTy>* llvm::StringMapEntry<ValueTy>::Create(const char*, const char*, AllocatorTy&, InitType)':
/usr/local/include/llvm/ADT/StringMap.h:170:33: error: expected primary-expression before '<' token
/usr/local/include/llvm/ADT/StringMap.h:170:48: error: expected primary-expression before '>' token
/usr/local/include/llvm/ADT/StringMap.h:170:50: error: expected primary-expression before ')' token
In file included from /usr/local/include/llvm/Support/Allocator.h:17:0,
                 from /usr/local/include/llvm/ADT/StringMap.h:18,
                 from /usr/local/include/llvm/PassRegistry.h:20,
                 from /usr/local/include/llvm/PassSupport.h:25,
                 from /usr/local/include/llvm/Pass.h:366,
                 from /usr/local/include/llvm/PassManager.h:20,
                 from /usr/ports/graphics/lightspark-devel/work/lightspark/scripting/abc.h:27,
                 from /usr/ports/graphics/lightspark-devel/work/lightspark/swf.cpp:23:
/usr/local/include/llvm/Support/AlignOf.h:57:24: error: expected unqualified-id before 'alignof'
In file included from /usr/local/include/llvm/ADT/StringMap.h:18:0,
                 from /usr/local/include/llvm/PassRegistry.h:20,
                 from /usr/local/include/llvm/PassSupport.h:25,
                 from /usr/local/include/llvm/Pass.h:366,
                 from /usr/local/include/llvm/PassManager.h:20,
                 from /usr/ports/graphics/lightspark-devel/work/lightspark/scripting/abc.h:27,
                 from /usr/ports/graphics/lightspark-devel/work/lightspark/swf.cpp:23:
/usr/local/include/llvm/Support/Allocator.h: In member function 'void llvm::SpecificBumpPtrAllocator<T>::DestroyAll()':
/usr/local/include/llvm/Support/Allocator.h:204:46: error: expected primary-expression before '<' token
/usr/local/include/llvm/Support/Allocator.h:204:48: error: expected primary-expression before '>' token
/usr/local/include/llvm/Support/Allocator.h:204:50: error: expected primary-expression before ')' token
In file included from /usr/local/include/llvm/PassRegistry.h:20:0,
                 from /usr/local/include/llvm/PassSupport.h:25,
                 from /usr/local/include/llvm/Pass.h:366,
                 from /usr/local/include/llvm/PassManager.h:20,
                 from /usr/ports/graphics/lightspark-devel/work/lightspark/scripting/abc.h:27,
                 from /usr/ports/graphics/lightspark-devel/work/lightspark/swf.cpp:23:
/usr/local/include/llvm/ADT/StringMap.h: In static member function 'static llvm::StringMapEntry<ValueTy>* llvm::StringMapEntry<ValueTy>::Create(const char*, const char*, AllocatorTy&, InitType)':
/usr/local/include/llvm/ADT/StringMap.h:170:33: error: expected primary-expression before '<' token
/usr/local/include/llvm/ADT/StringMap.h:170:48: error: expected primary-expression before '>' token
/usr/local/include/llvm/ADT/StringMap.h:170:50: error: expected primary-expression before ')' token
*** Error code 1
*** Error code 1
2 errors
*** Error code 2
1 error
*** Error code 2
1 error
*** Error code 1

Stop in /usr/ports/graphics/lightspark-devel.
ERROR: 2.1 Build failed of graphics/lightspark-devel/!!!


More information about the Pbibuild mailing list