[Pbibuild] PBI-8 Autobuild (amd64): graphics/lightspark-devel/

Build 8x64 root at build8x64.pcbsd.org
Sat Mar 26 19:41:35 PDT 2011


PBI Autobuild results for module graphics/lightspark-devel/:
Status: Failed

View Folder:
ftp://ftp.pcbsd.org/pub/pbioutgoing/x64/8/graphics/lightspark-devel//

File listing:
-rw-r--r--  1 root  wheel    1467813 Mar 26 19:41 build.log.bz2
-rw-r--r--  1 root  wheel          0 Mar 24 23:01 build.time
-rwxr-xr-x  1 root  wheel  135492952 Mar 13 20:50 lightspark-devel-r20110309-amd64.pbi
-rw-r--r--  1 root  wheel         78 Mar 26 19:41 lightspark-devel-r20110309-amd64.pbi.md5
-rw-r--r--  1 root  wheel         16 Mar 13 20:50 mdate

PBI MD5:
MD5 (lightspark-devel-r20110309-amd64.pbi) = 6feffd63504da8a0c86edcb33757f954


Last 50 lines of build.log
---------------------------------------------------
                 from /usr/local/include/llvm/PassSupport.h:25,
                 from /usr/local/include/llvm/Pass.h:366,
                 from /usr/local/include/llvm/PassManager.h:20,
                 from /usr/ports/graphics/lightspark-devel/work/lightspark/scripting/abc.h:27,
                 from /usr/ports/graphics/lightspark-devel/work/lightspark/frame.cpp:20:
/usr/local/include/llvm/ADT/StringMap.h: In static member function 'static llvm::StringMapEntry<ValueTy>* llvm::StringMapEntry<ValueTy>::Create(const char*, const char*, AllocatorTy&, InitType)':
/usr/local/include/llvm/ADT/StringMap.h:170:33: error: expected primary-expression before '<' token
/usr/local/include/llvm/ADT/StringMap.h:170:48: error: expected primary-expression before '>' token
/usr/local/include/llvm/ADT/StringMap.h:170:50: error: expected primary-expression before ')' token
In file included from /usr/local/include/llvm/Support/Allocator.h:17:0,
                 from /usr/local/include/llvm/ADT/StringMap.h:18,
                 from /usr/local/include/llvm/PassRegistry.h:20,
                 from /usr/local/include/llvm/PassSupport.h:25,
                 from /usr/local/include/llvm/Pass.h:366,
                 from /usr/local/include/llvm/PassManager.h:20,
                 from /usr/ports/graphics/lightspark-devel/work/lightspark/scripting/abc.h:27,
                 from /usr/ports/graphics/lightspark-devel/work/lightspark/swf.cpp:23:
/usr/local/include/llvm/Support/AlignOf.h:57:24: error: expected unqualified-id before 'alignof'
In file included from /usr/local/include/llvm/ADT/StringMap.h:18:0,
                 from /usr/local/include/llvm/PassRegistry.h:20,
                 from /usr/local/include/llvm/PassSupport.h:25,
                 from /usr/local/include/llvm/Pass.h:366,
                 from /usr/local/include/llvm/PassManager.h:20,
                 from /usr/ports/graphics/lightspark-devel/work/lightspark/scripting/abc.h:27,
                 from /usr/ports/graphics/lightspark-devel/work/lightspark/swf.cpp:23:
/usr/local/include/llvm/Support/Allocator.h: In member function 'void llvm::SpecificBumpPtrAllocator<T>::DestroyAll()':
/usr/local/include/llvm/Support/Allocator.h:204:46: error: expected primary-expression before '<' token
/usr/local/include/llvm/Support/Allocator.h:204:48: error: expected primary-expression before '>' token
/usr/local/include/llvm/Support/Allocator.h:204:50: error: expected primary-expression before ')' token
In file included from /usr/local/include/llvm/PassRegistry.h:20:0,
                 from /usr/local/include/llvm/PassSupport.h:25,
                 from /usr/local/include/llvm/Pass.h:366,
                 from /usr/local/include/llvm/PassManager.h:20,
                 from /usr/ports/graphics/lightspark-devel/work/lightspark/scripting/abc.h:27,
                 from /usr/ports/graphics/lightspark-devel/work/lightspark/swf.cpp:23:
/usr/local/include/llvm/ADT/StringMap.h: In static member function 'static llvm::StringMapEntry<ValueTy>* llvm::StringMapEntry<ValueTy>::Create(const char*, const char*, AllocatorTy&, InitType)':
/usr/local/include/llvm/ADT/StringMap.h:170:33: error: expected primary-expression before '<' token
/usr/local/include/llvm/ADT/StringMap.h:170:48: error: expected primary-expression before '>' token
/usr/local/include/llvm/ADT/StringMap.h:170:50: error: expected primary-expression before ')' token
*** Error code 1
*** Error code 1
2 errors
*** Error code 2
1 error
*** Error code 2
1 error
*** Error code 1

Stop in /usr/ports/graphics/lightspark-devel.
ERROR: 2.1 Build failed of graphics/lightspark-devel/!!!


More information about the Pbibuild mailing list