[Pbibuild] PBI-8 Autobuild (amd64): audio/amarok-kde4/

Build 8x64 root at build8x64.pcbsd.org
Fri Mar 25 20:58:10 PDT 2011


PBI Autobuild results for module audio/amarok-kde4/:
Status: Failed

View Folder:
ftp://ftp.pcbsd.org/pub/pbioutgoing/x64/8/audio/amarok-kde4//

File listing:
-rwxr-xr-x  1 root  wheel  305612597 Mar 19 20:56 amarok-2.4.0_2-amd64.pbi
-rw-r--r--  1 root  wheel         66 Mar 25 20:57 amarok-2.4.0_2-amd64.pbi.md5
-rw-r--r--  1 root  wheel    1506049 Mar 25 20:57 build.log.bz2
-rw-r--r--  1 root  wheel          0 Mar 19 20:56 build.time
-rw-r--r--  1 root  wheel          7 Feb 10  2010 dirstatus
-rw-r--r--  1 root  wheel         16 Mar 19 20:56 mdate

PBI MD5:
MD5 (amarok-2.4.0_2-amd64.pbi) = 454564f06c23db215017cde81744ab28


Last 50 lines of build.log
---------------------------------------------------
if /bin/sh /Programs/Amarok/bin/libtool --mode=compile c++ -DHAVE_CONFIG_H  -I. -I. -I.. -I../include     -O2 -pipe -fno-strict-aliasing -MT fft_op.lo -MD -MP -MF ".deps/fft_op.Tpo" -c -o fft_op.lo fft_op.cpp;  then mv -f ".deps/fft_op.Tpo" ".deps/fft_op.Plo"; else rm -f ".deps/fft_op.Tpo"; exit 1; fi
libtool: compile:  c++ -DHAVE_CONFIG_H -I. -I. -I.. -I../include -O2 -pipe -fno-strict-aliasing -MT fftlibw3_op.lo -MD -MP -MF .deps/fftlibw3_op.Tpo -c fftlibw3_op.cpp  -fPIC -DPIC -o .libs/fftlibw3_op.o
libtool: compile:  c++ -DHAVE_CONFIG_H -I. -I. -I.. -I../include -O2 -pipe -fno-strict-aliasing -MT fft_op.lo -MD -MP -MF .deps/fft_op.Tpo -c fft_op.cpp  -fPIC -DPIC -o .libs/fft_op.o
In file included from fftlibw3_op.cpp:19:
fftlib_op.h:35:19: error: fftw3.h: No such file or directory
In file included from fftlibw3_op.cpp:19:
fftlib_op.h:47: error: 'fftw_plan' does not name a type
fftlib_op.h: In constructor 'FFTLib_op::FFTLib_op()':
fftlib_op.h:39: error: 'PlanF' was not declared in this scope
fftlibw3_op.cpp: In member function 'void FFTLib_op::Initialize(int, bool)':
fftlibw3_op.cpp:26: error: 'FFTW_MEASURE' was not declared in this scope
fftlibw3_op.cpp:28: error: 'FFTW_ESTIMATE' was not declared in this scope
fftlibw3_op.cpp: In member function 'void FFTLib_op::Destroy()':
fftlibw3_op.cpp:35: error: 'PlanF' was not declared in this scope
fftlibw3_op.cpp:35: error: 'fftw_destroy_plan' was not declared in this scope
fftlibw3_op.cpp: In member function 'void FFTLib_op::SetSize(int, bool, double*, double*)':
fftlibw3_op.cpp:42: error: 'FFTW_MEASURE' was not declared in this scope
fftlibw3_op.cpp:44: error: 'FFTW_ESTIMATE' was not declared in this scope
fftlibw3_op.cpp:46: error: 'PlanF' was not declared in this scope
fftlibw3_op.cpp:48: error: 'fftw_destroy_plan' was not declared in this scope
fftlibw3_op.cpp:52: error: 'PlanF' was not declared in this scope
fftlibw3_op.cpp:52: error: 'FFTW_R2HC' was not declared in this scope
fftlibw3_op.cpp:52: error: 'fftw_plan_r2r_1d' was not declared in this scope
fftlibw3_op.cpp: In member function 'void FFTLib_op::ComputeFrame(int, double*, double*)':
fftlibw3_op.cpp:58: error: 'PlanF' was not declared in this scope
fftlibw3_op.cpp:58: error: 'fftw_execute' was not declared in this scope
*** Error code 1
In file included from fft_op.h:23,
                 from fft_op.cpp:17:
fftlib_op.h:35:19: error: fftw3.h: No such file or directory
In file included from fft_op.h:23,
                 from fft_op.cpp:17:
fftlib_op.h:47: error: 'fftw_plan' does not name a type
fftlib_op.h: In constructor 'FFTLib_op::FFTLib_op()':
fftlib_op.h:39: error: 'PlanF' was not declared in this scope
*** Error code 1
2 errors
*** Error code 1
1 error
*** Error code 1
1 error
*** Error code 2
1 error
*** Error code 1

Stop in /usr/ports/audio/libofa.
*** Error code 1

Stop in /usr/ports/audio/amarok-kde4.
ERROR: 2.1 Build failed of audio/amarok-kde4/!!!


More information about the Pbibuild mailing list