[Pbibuild] PBI-8 Autobuild (amd64): graphics/lightspark-devel/

Build 8x64 root at build8x64.pcbsd.org
Sun Mar 6 11:17:47 PST 2011


PBI Autobuild results for module graphics/lightspark-devel/:
Status: Failed

View Folder:
ftp://ftp.pcbsd.org/pub/pbioutgoing/x64/8/graphics/lightspark-devel//

File listing:
-rw-r--r--  1 root  wheel  699205 Mar  6 11:17 build.log.bz2

PBI MD5:



Last 50 lines of build.log
---------------------------------------------------
1 error
*** Error code 2
1 error
*** Error code 1

Stop in /usr/ports/graphics/lightspark-devel.
===>  Building for lightspark-devel-r20100625_1
/Programs/lightspark-devel/bin/cmake -H/usr/ports/graphics/lightspark-devel/work/lightspark -B/usr/ports/graphics/lightspark-devel/work/lightspark --check-build-system CMakeFiles/Makefile.cmake 0
/Programs/lightspark-devel/bin/cmake -E cmake_progress_start /usr/ports/graphics/lightspark-devel/work/lightspark/CMakeFiles /usr/ports/graphics/lightspark-devel/work/lightspark/CMakeFiles/progress.marks
make -f CMakeFiles/Makefile2 all
make -f CMakeFiles/spark.dir/build.make CMakeFiles/spark.dir/depend
cd /usr/ports/graphics/lightspark-devel/work/lightspark && /Programs/lightspark-devel/bin/cmake -E cmake_depends "Unix Makefiles" /usr/ports/graphics/lightspark-devel/work/lightspark /usr/ports/graphics/lightspark-devel/work/lightspark /usr/ports/graphics/lightspark-devel/work/lightspark /usr/ports/graphics/lightspark-devel/work/lightspark /usr/ports/graphics/lightspark-devel/work/lightspark/CMakeFiles/spark.dir/DependInfo.cmake --color=
make -f CMakeFiles/spark.dir/build.make CMakeFiles/spark.dir/build
/Programs/lightspark-devel/bin/cmake -E cmake_progress_report /usr/ports/graphics/lightspark-devel/work/lightspark/CMakeFiles 2
/Programs/lightspark-devel/bin/cmake -E cmake_progress_report /usr/ports/graphics/lightspark-devel/work/lightspark/CMakeFiles 3
[  5%] [  5%] Building CXX object CMakeFiles/spark.dir/swf.cpp.o
/usr/bin/c++   -Dspark_EXPORTS -DENABLE_SOUND -DDATADIR=\"/Programs/lightspark-devel/share/lightspark\" -O2 -pipe -fno-strict-aliasing -fpermissive -Wall -Wnon-virtual-dtor -Woverloaded-virtual -pipe -fvisibility=hidden -fPIC -I/Programs/lightspark-devel/include/SDL -I/Programs/lightspark-devel/include -I/Programs/lightspark-devel/include/drm -I/Programs/lightspark-devel/include/FTGL -I/Programs/lightspark-devel/include/freetype2 -I/usr/include/GL -o CMakeFiles/spark.dir/swf.cpp.o -c /usr/ports/graphics/lightspark-devel/work/lightspark/swf.cpp
Building CXX object CMakeFiles/spark.dir/swftypes.cpp.o
/usr/bin/c++   -Dspark_EXPORTS -DENABLE_SOUND -DDATADIR=\"/Programs/lightspark-devel/share/lightspark\" -O2 -pipe -fno-strict-aliasing -fpermissive -Wall -Wnon-virtual-dtor -Woverloaded-virtual -pipe -fvisibility=hidden -fPIC -I/Programs/lightspark-devel/include/SDL -I/Programs/lightspark-devel/include -I/Programs/lightspark-devel/include/drm -I/Programs/lightspark-devel/include/FTGL -I/Programs/lightspark-devel/include/freetype2 -I/usr/include/GL -o CMakeFiles/spark.dir/swftypes.cpp.o -c /usr/ports/graphics/lightspark-devel/work/lightspark/swftypes.cpp
In file included from /Programs/lightspark-devel/include/llvm/Attributes.h:18,
                 from /Programs/lightspark-devel/include/llvm/Argument.h:18,
                 from /Programs/lightspark-devel/include/llvm/Function.h:24,
                 from /Programs/lightspark-devel/include/llvm/Module.h:18,
                 from /usr/ports/graphics/lightspark-devel/work/lightspark/abc.h:24,
                 from /usr/ports/graphics/lightspark-devel/work/lightspark/swf.cpp:26:
/Programs/lightspark-devel/include/llvm/Support/MathExtras.h: In function 'bool llvm::isInt(int64_t)':
/Programs/lightspark-devel/include/llvm/Support/MathExtras.h:38: warning: there are no arguments to 'INT64_C' that depend on a template parameter, so a declaration of 'INT64_C' must be available
/Programs/lightspark-devel/include/llvm/Support/MathExtras.h:38: warning: there are no arguments to 'INT64_C' that depend on a template parameter, so a declaration of 'INT64_C' must be available
/Programs/lightspark-devel/include/llvm/Support/MathExtras.h: In function 'bool llvm::isUInt(uint64_t)':
/Programs/lightspark-devel/include/llvm/Support/MathExtras.h:57: warning: there are no arguments to 'UINT64_C' that depend on a template parameter, so a declaration of 'UINT64_C' must be available
In file included from /usr/ports/graphics/lightspark-devel/work/lightspark/swftypes.cpp:23:
/usr/ports/graphics/lightspark-devel/work/lightspark/abc.h:608: warning: ISO C++ forbids declaration of 'FunctionPassManager' with no type
/usr/ports/graphics/lightspark-devel/work/lightspark/abc.h:608: error: invalid use of '::'
/usr/ports/graphics/lightspark-devel/work/lightspark/abc.h:608: error: expected ';' before '*' token
In file included from /usr/ports/graphics/lightspark-devel/work/lightspark/swf.cpp:26:
/usr/ports/graphics/lightspark-devel/work/lightspark/abc.h: At global scope:
/usr/ports/graphics/lightspark-devel/work/lightspark/abc.h:608: warning: ISO C++ forbids declaration of 'FunctionPassManager' with no type
/usr/ports/graphics/lightspark-devel/work/lightspark/abc.h:608: error: invalid use of '::'
/usr/ports/graphics/lightspark-devel/work/lightspark/abc.h:608: error: expected ';' before '*' token
*** Error code 1
*** Error code 1
2 errors
*** Error code 2
1 error
*** Error code 2
1 error
*** Error code 1

Stop in /usr/ports/graphics/lightspark-devel.
ERROR: 2.1 Build failed of graphics/lightspark-devel/!!!


More information about the Pbibuild mailing list