[Pbibuild] PBI-8 Autobuild (amd64): www/firefox/

Build 8x64 root at build8x64.pcbsd.org
Tue Sep 14 09:57:01 PDT 2010


PBI Autobuild results for module www/firefox/:
Status: Failed

View Folder:
ftp://ftp.pcbsd.org/pub/pbioutgoing/x64/8/www/firefox//

File listing:
-rw-r--r--  1 root  wheel    872714 Sep 14 09:56 build.log.bz2
-rw-r--r--  1 root  wheel         0 Sep 13 12:42 build.time
-rwxr-xr-x  1 root  wheel  75206496 Jul 27 21:34 firefox-3.6.8-amd64.pbi
-rw-r--r--  1 root  wheel        65 Sep 14 09:56 firefox-3.6.8-amd64.pbi.md5
-rw-r--r--  1 root  wheel        16 Jul 27 21:34 mdate

PBI MD5:
MD5 (firefox-3.6.8-amd64.pbi) = 82dc088bb5bb0a78c71d4beb023c7a69


Last 50 lines of build.log
---------------------------------------------------
Source/plugin.cpp:583: error: 'free' was not declared in this scope
Source/plugin.cpp:588: error: 'free' was not declared in this scope
Source/plugin.cpp:593: error: 'free' was not declared in this scope
Source/plugin.cpp:598: error: 'free' was not declared in this scope
Source/plugin.cpp:603: error: 'free' was not declared in this scope
Source/plugin.cpp:608: error: 'free' was not declared in this scope
Source/plugin.cpp:614: error: 'free' was not declared in this scope
Source/plugin.cpp:619: error: 'free' was not declared in this scope
Source/plugin.cpp:627: error: 'free' was not declared in this scope
Source/plugin.cpp:633: error: 'free' was not declared in this scope
Source/plugin.cpp: In member function 'virtual NPError nsPluginInstance::DestroyStream(NPStream*, NPError)':
Source/plugin.cpp:1488: error: 'free' was not declared in this scope
Source/plugin.cpp: In member function 'void nsPluginInstance::Play()':
Source/plugin.cpp:2241: warning: deprecated conversion from string constant to 'char*'
Source/plugin.cpp: In member function 'void nsPluginInstance::Pause()':
Source/plugin.cpp:2271: warning: deprecated conversion from string constant to 'char*'
Source/plugin.cpp: In member function 'void nsPluginInstance::Stop()':
Source/plugin.cpp:2291: warning: deprecated conversion from string constant to 'char*'
Source/plugin.cpp:2293: warning: deprecated conversion from string constant to 'char*'
Source/plugin.cpp:2303: warning: deprecated conversion from string constant to 'char*'
Source/plugin.cpp: In member function 'void nsPluginInstance::Quit()':
Source/plugin.cpp:2321: warning: deprecated conversion from string constant to 'char*'
Source/plugin.cpp:2322: warning: deprecated conversion from string constant to 'char*'
Source/plugin.cpp: In member function 'void nsPluginInstance::FastForward()':
Source/plugin.cpp:2348: warning: deprecated conversion from string constant to 'char*'
Source/plugin.cpp:2349: warning: deprecated conversion from string constant to 'char*'
Source/plugin.cpp:2351: warning: deprecated conversion from string constant to 'char*'
Source/plugin.cpp: In member function 'void nsPluginInstance::FastReverse()':
Source/plugin.cpp:2375: warning: deprecated conversion from string constant to 'char*'
Source/plugin.cpp:2376: warning: deprecated conversion from string constant to 'char*'
Source/plugin.cpp:2378: warning: deprecated conversion from string constant to 'char*'
Source/plugin.cpp: In member function 'void nsPluginInstance::Seek(double)':
Source/plugin.cpp:2391: warning: deprecated conversion from string constant to 'char*'
Source/plugin.cpp:2395: warning: deprecated conversion from string constant to 'char*'
Source/plugin.cpp: In member function 'void nsPluginInstance::VolumeUp()':
Source/plugin.cpp:2409: warning: deprecated conversion from string constant to 'char*'
Source/plugin.cpp: In member function 'void nsPluginInstance::VolumeDown()':
Source/plugin.cpp:2423: warning: deprecated conversion from string constant to 'char*'
Source/plugin.cpp: In member function 'void nsPluginInstance::SetFilename(const char*)':
Source/plugin.cpp:2529: error: 'free' was not declared in this scope
Source/plugin.cpp:2533: error: 'free' was not declared in this scope
Source/plugin.cpp:2546: error: 'free' was not declared in this scope
Source/plugin.cpp:2551: error: 'free' was not declared in this scope
Source/plugin.cpp:2556: error: 'free' was not declared in this scope
gmake: *** [plugin.o] Error 1
*** Error code 1

Stop in /usr/ports/www/mplayer-plugin.
OTHERPORT: Build failed on /usr/ports/www/mplayer-plugin
ERROR: 2.1 Build failed of www/firefox/!!!


More information about the Pbibuild mailing list