[Pbibuild] PBI-8 Autobuild (amd64): math/scilab/

Build 8x64 root at build8x64.pcbsd.org
Wed Sep 1 18:01:13 PDT 2010


PBI Autobuild results for module math/scilab/:
Status: Failed

View Folder:
ftp://ftp.pcbsd.org/pub/pbioutgoing/x64/8/math/scilab//

File listing:
-rw-r--r--  1 root  wheel  993968 Sep  1 18:00 build.log.bz2
-rw-r--r--  1 root  wheel       0 Aug 31 18:31 build.time

PBI MD5:



Last 50 lines of build.log
---------------------------------------------------
    [javac] symbol  : method getFillPaint(java.awt.Rectangle,java.awt.Color,java.util.Map<java.lang.String,java.lang.Object>)
    [javac] location: class org.scilab.modules.graph.ScilabCanvas
    [javac] 				Paint fillPaint = getFillPaint(bounds, fillColor, style);
    [javac] 				                  ^
    [javac] /usr/ports/math/scilab/work/scilab-5.2.2/modules/xcos/src/java/org/scilab/modules/graph/ScilabCanvas.java:247: cannot find symbol
    [javac] symbol  : method drawArrow(java.util.List<com.mxgraph.util.mxPoint>,java.awt.Color,java.awt.Paint,java.awt.Color,boolean)
    [javac] location: class org.scilab.modules.graph.ScilabCanvas
    [javac] 				drawArrow(pts, fillColor, fillPaint, penColor, shadow);
    [javac] 				^
    [javac] /usr/ports/math/scilab/work/scilab-5.2.2/modules/xcos/src/java/org/scilab/modules/graph/ScilabCanvas.java:267: cannot find symbol
    [javac] symbol  : method drawConnector(java.util.List<com.mxgraph.util.mxPoint>,float,java.awt.Color,java.lang.Object,float,java.lang.Object,float,boolean,java.util.Map<java.lang.String,java.lang.Object>)
    [javac] location: class org.scilab.modules.graph.ScilabCanvas
    [javac] 				drawConnector(pts, penWidth, penColor, startMarker, startSize,
    [javac] 				^
    [javac] /usr/ports/math/scilab/work/scilab-5.2.2/modules/xcos/src/java/org/scilab/modules/graph/ScilabCanvas.java:275: cannot find symbol
    [javac] symbol  : method drawMarker(java.lang.Object,com.mxgraph.util.mxPoint,com.mxgraph.util.mxPoint,float,float)
    [javac] location: class org.scilab.modules.graph.ScilabCanvas
    [javac] 					drawMarker(centerMarker, pts.get(1), new mxPoint(x, y), centerSize, penWidth);
    [javac] 					^
    [javac] /usr/ports/math/scilab/work/scilab-5.2.2/modules/xcos/src/java/org/scilab/modules/xcos/graph/XcosDiagram.java:451: cannot find symbol
    [javac] symbol  : method parse(java.lang.String)
    [javac] location: class com.mxgraph.util.mxUtils
    [javac] 	    Document document = mxUtils.parse(xml);
    [javac] 	                               ^
    [javac] /usr/ports/math/scilab/work/scilab-5.2.2/modules/xcos/src/java/org/scilab/modules/xcos/actions/RecentFileAction.java:39: warning: [deprecation] DefaultAction(java.lang.String,org.scilab.modules.graph.ScilabGraph) in org.scilab.modules.graph.actions.base.DefaultAction has been deprecated
    [javac] 		super(file.getName(), scilabGraph);
    [javac] 		^
    [javac] /usr/ports/math/scilab/work/scilab-5.2.2/modules/xcos/src/java/org/scilab/modules/xcos/actions/RecentFileAction.java:63: warning: [deprecation] createMenu(java.lang.String,java.lang.String,org.scilab.modules.graph.actions.base.DefaultAction,javax.swing.KeyStroke) in org.scilab.modules.graph.actions.base.DefaultAction has been deprecated
    [javac] 	    return createMenu(file.getName(), null, new RecentFileAction(scilabGraph, file), null);
    [javac] 	           ^
    [javac] Note: Some input files use unchecked or unsafe operations.
    [javac] Note: Recompile with -Xlint:unchecked for details.
    [javac] 11 errors
    [javac] 2 warnings

BUILD FAILED
/usr/ports/math/scilab/work/scilab-5.2.2/build.incl.xml:165: Compile failed; see the compiler error output for details.

Total time: 3 seconds
gmake[3]: *** [java] Error 1
gmake[3]: Leaving directory `/usr/ports/math/scilab/work/scilab-5.2.2/modules/xcos'
gmake[2]: *** [all] Error 2
gmake[2]: Leaving directory `/usr/ports/math/scilab/work/scilab-5.2.2/modules/xcos'
gmake[1]: *** [all-recursive] Error 1
gmake[1]: Leaving directory `/usr/ports/math/scilab/work/scilab-5.2.2/modules'
gmake: *** [all-recursive] Error 1
*** Error code 1

Stop in /usr/ports/math/scilab.
ERROR: 2.1 Build failed of math/scilab/!!!


More information about the Pbibuild mailing list