[Pbibuild] PBI-8 Autobuild (i386): math/scilab/

Build 8x32 root at build8x32.pcbsd.org
Tue Oct 19 10:18:09 PDT 2010


PBI Autobuild results for module math/scilab/:
Status: Failed

View Folder:
ftp://ftp.pcbsd.org/pub/pbioutgoing/x32/8/math/scilab//

File listing:
-rw-r--r--  1 root  wheel    1088064 Oct 19 10:17 build.log.bz2
-rw-r--r--  1 root  wheel          0 Oct 15 00:56 build.time
-rw-r--r--  1 root  wheel         16 Oct 15 00:56 mdate
-rwxr-xr-x  1 root  wheel  211611658 Oct 15 00:56 scilab-5.2.2_4-i386.pbi
-rw-r--r--  1 root  wheel         65 Oct 19 10:17 scilab-5.2.2_4-i386.pbi.md5

PBI MD5:
MD5 (scilab-5.2.2_4-i386.pbi) = f1273a4e9647c2bdcda6acf0adcb94ac


Last 50 lines of build.log
---------------------------------------------------
Making all in texmacs
gmake[2]: Entering directory `/usr/ports/math/scilab/work/scilab-5.2.2/modules/texmacs'
gmake[2]: Leaving directory `/usr/ports/math/scilab/work/scilab-5.2.2/modules/texmacs'
Making all in development_tools
gmake[2]: Entering directory `/usr/ports/math/scilab/work/scilab-5.2.2/modules/development_tools'
gmake[2]: Leaving directory `/usr/ports/math/scilab/work/scilab-5.2.2/modules/development_tools'
Making all in compatibility_functions
gmake[2]: Entering directory `/usr/ports/math/scilab/work/scilab-5.2.2/modules/compatibility_functions'
gmake[2]: Leaving directory `/usr/ports/math/scilab/work/scilab-5.2.2/modules/compatibility_functions'
Making all in helptools
gmake[2]: Entering directory `/usr/ports/math/scilab/work/scilab-5.2.2/modules/helptools'
gmake  all-am
gmake[3]: Entering directory `/usr/ports/math/scilab/work/scilab-5.2.2/modules/helptools'
Buildfile: build.xml
  [taskdef] Could not load definitions from resource checkstyletask.properties. It could not be found.

init:

compile:
    [javac] Compiling 4 source files to /usr/ports/math/scilab/work/scilab-5.2.2/modules/helptools/build/classes
    [javac] /usr/ports/math/scilab/work/scilab-5.2.2/modules/helptools/src/java/org/scilab/modules/helptools/BuildPDF.java
    [javac] /usr/ports/math/scilab/work/scilab-5.2.2/modules/helptools/src/java/org/scilab/modules/helptools/CopyConvert.java
    [javac] /usr/ports/math/scilab/work/scilab-5.2.2/modules/helptools/src/java/org/scilab/modules/helptools/HelpViewer.java
    [javac] /usr/ports/math/scilab/work/scilab-5.2.2/modules/helptools/src/java/org/scilab/modules/helptools/Helpers.java
    [javac] /usr/ports/math/scilab/work/scilab-5.2.2/modules/helptools/src/java/org/scilab/modules/helptools/BuildPDF.java:76: cannot access org.apache.xmlgraphics.util.MimeConstants
    [javac] class file for org.apache.xmlgraphics.util.MimeConstants not found
    [javac] 				fop = fopFactory.newFop(MimeConstants.MIME_POSTSCRIPT, out);
    [javac] 				                                     ^
    [javac] /usr/ports/math/scilab/work/scilab-5.2.2/modules/helptools/src/java/org/scilab/modules/helptools/BuildPDF.java:78: cannot find symbol
    [javac] symbol  : variable MIME_PDF
    [javac] location: interface org.apache.fop.apps.MimeConstants
    [javac] 				fop = fopFactory.newFop(MimeConstants.MIME_PDF, out);
    [javac] 				                                     ^
    [javac] 2 errors

BUILD FAILED
/usr/ports/math/scilab/work/scilab-5.2.2/build.incl.xml:165: Compile failed; see the compiler error output for details.

Total time: 1 second
gmake[3]: *** [java] Error 1
gmake[3]: Leaving directory `/usr/ports/math/scilab/work/scilab-5.2.2/modules/helptools'
gmake[2]: *** [all] Error 2
gmake[2]: Leaving directory `/usr/ports/math/scilab/work/scilab-5.2.2/modules/helptools'
gmake[1]: *** [all-recursive] Error 1
gmake[1]: Leaving directory `/usr/ports/math/scilab/work/scilab-5.2.2/modules'
gmake: *** [all-recursive] Error 1
*** Error code 1

Stop in /usr/ports/math/scilab.
ERROR: 2.1 Build failed of math/scilab/!!!


More information about the Pbibuild mailing list