[Pbibuild] PBI-7 Autobuild (amd64): multimedia/vlc/

Build 7x64 root at build7x64.pcbsd.org
Wed Nov 17 11:46:40 PST 2010


PBI Autobuild results for module multimedia/vlc/:
Status: Failed

View Folder:
ftp://ftp.pcbsd.org/pub/pbioutgoing/x64/7/multimedia/vlc//

File listing:
-rw-r--r--  1 root  wheel    908945 Nov 17 11:46 build.log.bz2
-rw-r--r--  1 kris  wheel         0 Nov 16 15:53 build.time
-rw-r--r--  1 kris  wheel        16 Sep 15 16:24 mdate
-rwxr-xr-x  1 root  wheel  82196575 Sep 15 16:24 vlc-1.1.4_2-amd64.pbi
-rw-r--r--  1 root  wheel        63 Nov 17 11:46 vlc-1.1.4_2-amd64.pbi.md5

PBI MD5:
MD5 (vlc-1.1.4_2-amd64.pbi) = 28318bd0b1a88ff0a8d096a29a5b2625


Last 50 lines of build.log
---------------------------------------------------
freetype.c:350: warning: unused variable 't2'
freetype.c: In function 'LoadFontsFromAttachments':
freetype.c:544: warning: 'vlc_object_find' is deprecated (declared at ../../include/vlc_objects.h:74)
  CC     libinhibit_plugin_la-inhibit.lo
  CC     libxdg_screensaver_plugin_la-xdg.lo
inhibit/xdg.c: In function 'Thread':
inhibit/xdg.c:119: warning: unused variable 'argv'
  CC     libxscreensaver_plugin_la-xscreensaver.lo
  CC     libaudioscrobbler_plugin_la-audioscrobbler.lo
inhibit/xscreensaver.c:55: error: expected specifier-qualifier-list before 'posix_spawn_file_actions_t'
inhibit/xscreensaver.c: In function 'Activate':
inhibit/xscreensaver.c:91: error: implicit declaration of function 'posix_spawn_file_actions_init'
inhibit/xscreensaver.c:91: error: 'vlc_inhibit_sys_t' has no member named 'actions'
inhibit/xscreensaver.c:94: error: implicit declaration of function 'posix_spawn_file_actions_adddup2'
inhibit/xscreensaver.c:94: error: 'vlc_inhibit_sys_t' has no member named 'actions'
inhibit/xscreensaver.c:95: error: 'vlc_inhibit_sys_t' has no member named 'actions'
inhibit/xscreensaver.c:96: error: implicit declaration of function 'posix_spawn_file_actions_addclose'
inhibit/xscreensaver.c:96: error: 'vlc_inhibit_sys_t' has no member named 'actions'
inhibit/xscreensaver.c:98: error: 'vlc_inhibit_sys_t' has no member named 'nullfd'
inhibit/xscreensaver.c:101: error: implicit declaration of function 'posix_spawnattr_init'
inhibit/xscreensaver.c:101: error: 'vlc_inhibit_sys_t' has no member named 'attr'
inhibit/xscreensaver.c:103: error: implicit declaration of function 'posix_spawnattr_setsigmask'
inhibit/xscreensaver.c:103: error: 'vlc_inhibit_sys_t' has no member named 'attr'
inhibit/xscreensaver.c: In function 'Deactivate':
inhibit/xscreensaver.c:117: error: 'vlc_inhibit_sys_t' has no member named 'nullfd'
inhibit/xscreensaver.c:118: error: 'vlc_inhibit_sys_t' has no member named 'nullfd'
inhibit/xscreensaver.c:119: error: implicit declaration of function 'posix_spawnattr_destroy'
inhibit/xscreensaver.c:119: error: 'vlc_inhibit_sys_t' has no member named 'attr'
  CC     liblogger_plugin_la-logger.lo
inhibit/xscreensaver.c:120: error: implicit declaration of function 'posix_spawn_file_actions_destroy'
inhibit/xscreensaver.c:120: error: 'vlc_inhibit_sys_t' has no member named 'actions'
inhibit/xscreensaver.c: In function 'Execute':
inhibit/xscreensaver.c:133: warning: unused parameter 'p_ih'
inhibit/xscreensaver.c:133: warning: unused parameter 'argv'
gmake[5]: *** [libxscreensaver_plugin_la-xscreensaver.lo] Error 1
gmake[5]: *** Waiting for unfinished jobs....
gmake[5]: Leaving directory `/usr/ports/multimedia/vlc/work/vlc-1.1.5/modules/misc'
gmake[4]: *** [all-recursive] Error 1
gmake[4]: Leaving directory `/usr/ports/multimedia/vlc/work/vlc-1.1.5/modules/misc'
gmake[3]: *** [all] Error 2
gmake[3]: Leaving directory `/usr/ports/multimedia/vlc/work/vlc-1.1.5/modules/misc'
gmake[2]: *** [all-recursive] Error 1
gmake[2]: Leaving directory `/usr/ports/multimedia/vlc/work/vlc-1.1.5/modules'
gmake[1]: *** [all-recursive] Error 1
gmake[1]: Leaving directory `/usr/ports/multimedia/vlc/work/vlc-1.1.5'
gmake: *** [all] Error 2
*** Error code 1

Stop in /usr/ports/multimedia/vlc.
ERROR: 2.1 Build failed of multimedia/vlc/!!!


More information about the Pbibuild mailing list