[Pbibuild] PBI-8 Autobuild (amd64): x11-wm/enlightenment/

Build 8x64 root at build8x64.pcbsd.org
Tue Mar 30 19:08:58 PDT 2010


PBI Autobuild results for module x11-wm/enlightenment/:
Status: Failed

View Folder:
ftp://ftp.pcbsd.org/pub/pbioutgoing/x64/8/x11-wm/enlightenment//

File listing:
-rwxr-xr-x  1 root  wheel  39317209 Feb 21 14:07 Enlightenment0.16.999.042_4-PV0.pbi
-rw-r--r--  1 root  wheel        77 Mar 31 02:08 Enlightenment0.16.999.042_4-PV0.pbi.md5
-rw-r--r--  1 root  wheel    317295 Mar 31 02:08 build.log.bz2
-rw-r--r--  1 root  wheel         0 Feb 21 14:07 build.time
-rw-r--r--  1 root  wheel        16 Feb 21 14:07 mdate

PBI MD5:
MD5 (Enlightenment0.16.999.042_4-PV0.pbi) = 5b25d723d34639d18fefed07e197080b


Last 50 lines of build.log
---------------------------------------------------
gmake[3]: Nothing to be done for `all'.
gmake[3]: Leaving directory `/usr/ports/x11-wm/enlightenment/work/enlightenment-0.16.999.042/src/preload'
gmake[3]: Entering directory `/usr/ports/x11-wm/enlightenment/work/enlightenment-0.16.999.042/src'
gmake[3]: Nothing to be done for `all-am'.
gmake[3]: Leaving directory `/usr/ports/x11-wm/enlightenment/work/enlightenment-0.16.999.042/src'
gmake[2]: Leaving directory `/usr/ports/x11-wm/enlightenment/work/enlightenment-0.16.999.042/src'
Making all in data
gmake[2]: Entering directory `/usr/ports/x11-wm/enlightenment/work/enlightenment-0.16.999.042/data'
Making all in fonts
gmake[3]: Entering directory `/usr/ports/x11-wm/enlightenment/work/enlightenment-0.16.999.042/data/fonts'
gmake[3]: Nothing to be done for `all'.
gmake[3]: Leaving directory `/usr/ports/x11-wm/enlightenment/work/enlightenment-0.16.999.042/data/fonts'
Making all in images
gmake[3]: Entering directory `/usr/ports/x11-wm/enlightenment/work/enlightenment-0.16.999.042/data/images'
gmake[3]: Nothing to be done for `all'.
gmake[3]: Leaving directory `/usr/ports/x11-wm/enlightenment/work/enlightenment-0.16.999.042/data/images'
Making all in init
gmake[3]: Entering directory `/usr/ports/x11-wm/enlightenment/work/enlightenment-0.16.999.042/data/init'
Making all in images
gmake[4]: Entering directory `/usr/ports/x11-wm/enlightenment/work/enlightenment-0.16.999.042/data/init/images'
gmake[4]: Nothing to be done for `all'.
gmake[4]: Leaving directory `/usr/ports/x11-wm/enlightenment/work/enlightenment-0.16.999.042/data/init/images'
gmake[4]: Entering directory `/usr/ports/x11-wm/enlightenment/work/enlightenment-0.16.999.042/data/init'
gmake[4]: Nothing to be done for `all-am'.
gmake[4]: Leaving directory `/usr/ports/x11-wm/enlightenment/work/enlightenment-0.16.999.042/data/init'
gmake[3]: Leaving directory `/usr/ports/x11-wm/enlightenment/work/enlightenment-0.16.999.042/data/init'
Making all in themes
gmake[3]: Entering directory `/usr/ports/x11-wm/enlightenment/work/enlightenment-0.16.999.042/data/themes'
Making all in images
gmake[4]: Entering directory `/usr/ports/x11-wm/enlightenment/work/enlightenment-0.16.999.042/data/themes/images'
gmake[4]: Nothing to be done for `all'.
gmake[4]: Leaving directory `/usr/ports/x11-wm/enlightenment/work/enlightenment-0.16.999.042/data/themes/images'
gmake[4]: Entering directory `/usr/ports/x11-wm/enlightenment/work/enlightenment-0.16.999.042/data/themes'
/Programs/Enlightenment/bin/edje_cc -v -id ../../data/themes/images -fd ../../data/fonts -DLOWRES_PDA=1 -DMEDIUMRES_PDA=2 -DHIRES_PDA=3 -DSLOW_PC=4 -DMEDIUM_PC=5 -DFAST_PC=6 -DE17_PROFILE=SLOW_PC \
	../../data/themes/default.edc \
	../../data/themes/default.edj
/libexec/ld-elf.so.1: /Programs/Enlightenment/lib/evas/modules/loaders/png/freebsd8.0-amd64/module.so: Undefined symbol "png_check_sig"
gmake[4]: *** [default.edj] Error 1
gmake[4]: Leaving directory `/usr/ports/x11-wm/enlightenment/work/enlightenment-0.16.999.042/data/themes'
gmake[3]: *** [all-recursive] Error 1
gmake[3]: Leaving directory `/usr/ports/x11-wm/enlightenment/work/enlightenment-0.16.999.042/data/themes'
gmake[2]: *** [all-recursive] Error 1
gmake[2]: Leaving directory `/usr/ports/x11-wm/enlightenment/work/enlightenment-0.16.999.042/data'
gmake[1]: *** [all-recursive] Error 1
gmake[1]: Leaving directory `/usr/ports/x11-wm/enlightenment/work/enlightenment-0.16.999.042'
gmake: *** [all] Error 2
*** Error code 1

Stop in /usr/ports/x11-wm/enlightenment.
ERROR: 2.1 Build failed of x11-wm/enlightenment/!!!


More information about the Pbibuild mailing list