[Pbibuild] PBI-7 Autobuild (amd64): astro/celestia/

Build 7x64 root at build7x64.pcbsd.org
Tue Mar 30 17:40:21 PDT 2010


PBI Autobuild results for module astro/celestia/:
Status: Failed

View Folder:
ftp://ftp.pcbsd.org/pub/pbioutgoing/x64/7/astro/celestia//

File listing:
-rwxr-xr-x  1 root  wheel  45134728 Feb  9 22:30 Celestia1.6.0_1-PV0.pbi
-rw-r--r--  1 root  wheel        65 Mar 31 00:40 Celestia1.6.0_1-PV0.pbi.md5
-rw-r--r--  1 root  wheel    234987 Mar 31 00:40 build.log.bz2
-rw-r--r--  1 kris  wheel         0 Feb  9 22:30 build.time
-rw-r--r--  1 kris  wheel        16 Feb  9 22:30 mdate

PBI MD5:
MD5 (Celestia1.6.0_1-PV0.pbi) = 54163c0a756e0de0ab85262b19c6e167


Last 50 lines of build.log
---------------------------------------------------
gmake[3]: Leaving directory `/usr/ports/astro/celestia/work/celestia-1.6.0/src/celengine'
gmake[2]: *** [all-recursive] Error 1
gmake[2]: Leaving directory `/usr/ports/astro/celestia/work/celestia-1.6.0/src'
gmake[1]: *** [all-recursive] Error 1
gmake[1]: Leaving directory `/usr/ports/astro/celestia/work/celestia-1.6.0'
gmake: *** [all] Error 2
*** Error code 1

Stop in /usr/ports/astro/celestia.
===>  Building for celestia-glut-1.6.0_2
gmake  all-recursive
gmake[1]: Entering directory `/usr/ports/astro/celestia/work/celestia-1.6.0'
Making all in src
gmake[2]: Entering directory `/usr/ports/astro/celestia/work/celestia-1.6.0/src'
Making all in celutil
gmake[3]: Entering directory `/usr/ports/astro/celestia/work/celestia-1.6.0/src/celutil'
gmake[3]: Nothing to be done for `all'.
gmake[3]: Leaving directory `/usr/ports/astro/celestia/work/celestia-1.6.0/src/celutil'
Making all in celmath
gmake[3]: Entering directory `/usr/ports/astro/celestia/work/celestia-1.6.0/src/celmath'
gmake[3]: Nothing to be done for `all'.
gmake[3]: Leaving directory `/usr/ports/astro/celestia/work/celestia-1.6.0/src/celmath'
Making all in cel3ds
gmake[3]: Entering directory `/usr/ports/astro/celestia/work/celestia-1.6.0/src/cel3ds'
gmake[3]: Nothing to be done for `all'.
gmake[3]: Leaving directory `/usr/ports/astro/celestia/work/celestia-1.6.0/src/cel3ds'
Making all in celtxf
gmake[3]: Entering directory `/usr/ports/astro/celestia/work/celestia-1.6.0/src/celtxf'
gmake[3]: Nothing to be done for `all'.
gmake[3]: Leaving directory `/usr/ports/astro/celestia/work/celestia-1.6.0/src/celtxf'
Making all in celengine
gmake[3]: Entering directory `/usr/ports/astro/celestia/work/celestia-1.6.0/src/celengine'
c++ -DHAVE_CONFIG_H -I. -I../.. -I..  -I/Programs/Celestia1.6.0_2/include   -Wno-long-long -Wundef -Wall -W -Wpointer-arith -DNDEBUG -DNO_DEBUG -O2 -fno-strict-aliasing -pipe -Wno-non-virtual-dtor -fno-exceptions -fno-check-new -fno-common   -Wall    -I/Programs/Celestia1.6.0_2/include/lua51  -DLUA_VER=0x050100 -DCELX  -MT image.o -MD -MP -MF .deps/image.Tpo -c -o image.o image.cpp
In file included from ../celutil/util.h:42,
                 from image.cpp:59:
/Programs/Celestia1.6.0_2/include/libintl.h:91:25: warning: "__APPLE_CC__" is not defined
/Programs/Celestia1.6.0_2/include/libintl.h:113:24: warning: "__APPLE_CC__" is not defined
image.cpp: In function 'Image* LoadPNGImage(const std::string&)':
image.cpp:740: error: 'png_set_gray_1_2_4_to_8' was not declared in this scope
gmake[3]: *** [image.o] Error 1
gmake[3]: Leaving directory `/usr/ports/astro/celestia/work/celestia-1.6.0/src/celengine'
gmake[2]: *** [all-recursive] Error 1
gmake[2]: Leaving directory `/usr/ports/astro/celestia/work/celestia-1.6.0/src'
gmake[1]: *** [all-recursive] Error 1
gmake[1]: Leaving directory `/usr/ports/astro/celestia/work/celestia-1.6.0'
gmake: *** [all] Error 2
*** Error code 1

Stop in /usr/ports/astro/celestia.
ERROR: 2.1 Build failed of astro/celestia/!!!


More information about the Pbibuild mailing list