[Pbibuild] PBI-7 Autobuild (amd64): x11/kde3/

Build 7x64 root at build7x64.pcbsd.org
Tue Mar 30 07:02:29 PDT 2010


PBI Autobuild results for module x11/kde3/:
Status: Failed

View Folder:
ftp://ftp.pcbsd.org/pub/pbioutgoing/x64/7/x11/kde3//

File listing:
-rwxr-xr-x  1 root  wheel  492519590 Mar  8 04:20 KDE3.5.10_3-PV0.pbi
-rw-r--r--  1 root  wheel         61 Mar 30 14:02 KDE3.5.10_3-PV0.pbi.md5
-rw-r--r--  1 root  wheel    1507260 Mar 30 14:01 build.log.bz2
-rw-r--r--  1 root  wheel          0 Mar  8 04:20 build.time
-rw-r--r--  1 root  wheel         16 Mar  8 04:20 mdate

PBI MD5:
MD5 (KDE3.5.10_3-PV0.pbi) = 8bf9dba3f22a6526526e9d0599b6a110


Last 50 lines of build.log
---------------------------------------------------
gmake[4]: Nothing to be done for `all'.
gmake[4]: Leaving directory `/usr/ports/editors/koffice-kde3/work/koffice-1.6.3/filters/kugar/kugarnop'
gmake[4]: Entering directory `/usr/ports/editors/koffice-kde3/work/koffice-1.6.3/filters/kugar'
gmake[4]: Nothing to be done for `all-am'.
gmake[4]: Leaving directory `/usr/ports/editors/koffice-kde3/work/koffice-1.6.3/filters/kugar'
gmake[3]: Leaving directory `/usr/ports/editors/koffice-kde3/work/koffice-1.6.3/filters/kugar'
Making all in krita
gmake[3]: Entering directory `/usr/ports/editors/koffice-kde3/work/koffice-1.6.3/filters/krita'
Making all in openexr
gmake[4]: Entering directory `/usr/ports/editors/koffice-kde3/work/koffice-1.6.3/filters/krita/openexr'
gmake[4]: Nothing to be done for `all'.
gmake[4]: Leaving directory `/usr/ports/editors/koffice-kde3/work/koffice-1.6.3/filters/krita/openexr'
Making all in png
gmake[4]: Entering directory `/usr/ports/editors/koffice-kde3/work/koffice-1.6.3/filters/krita/png'
if /bin/sh /Programs/KDE3.5.10_4/bin/libtool --silent --tag=CXX --mode=compile c++ -DHAVE_CONFIG_H -I. -I. -I../../.. -I. -I../../../lib/kofficeui -I../../../lib/kofficeui -I../../../lib/kofficecore -I../../../lib/kofficecore -I../../../lib/store -I../../../lib/store -I../../../lib/kwmf -I../../../lib/kwmf -I../../../lib/kopalette -I../../../lib/kopalette -I../../../krita -I../../../krita/core -I../../../krita/sdk -I../../../krita/core/tiles -I../../../krita/kritacolor -I../../../krita/ui -I../../../lib/kofficeui -I../../../lib/kofficeui -I../../../lib/kofficecore -I../../../lib/kofficecore -I../../../lib/store -I../../../lib/store -I../../../lib/kwmf -I../../../lib/kwmf -I../../../lib/kopalette -I../../../lib/kopalette -I../../../lib/interfaces -I../../../lib/kopainter -I../../../lib/kopainter -I/Programs/KDE3.5.10_4/include  -I/Programs/KDE3.5.10_4/include   -D_THREAD_SAFE -pthread -DQT_THREAD_SUPPORT -I/Programs/KDE3.5.10_4/include -D_THREAD_SAFE   -Wno-long-long -Wundef !
 -Wall -W -Wpointer-arith -DNDEBUG -DNO_DEBUG -O2 -O2 -fno-strict-aliasing -pipe -Wno-non-virtual-dtor -fno-exceptions -fno-check-new -fno-common -DQT_CLEAN_NAMESPACE -DQT_NO_ASCII_CAST -DQT_NO_STL -DQT_NO_COMPAT -DQT_NO_TRANSLATION -DHAVE_KNEWSTUFF -fexceptions -MT kis_png_converter.lo -MD -MP -MF ".deps/kis_png_converter.Tpo" -c -o kis_png_converter.lo kis_png_converter.cc; \
	then mv -f ".deps/kis_png_converter.Tpo" ".deps/kis_png_converter.Plo"; else rm -f ".deps/kis_png_converter.Tpo"; exit 1; fi
In file included from ../../../krita/sdk/kis_global.h:23,
                 from kis_png_converter.h:32,
                 from kis_png_converter.cc:21:
/Programs/KDE3.5.10_4/include/lcms.h:146:5: warning: "TARGET_CPU_PPC" is not defined
/Programs/KDE3.5.10_4/include/lcms.h:150:5: warning: "macintosh" is not defined
In file included from ../../../krita/sdk/kis_global.h:23,
                 from kis_png_converter.h:32,
                 from kis_png_converter.cc:21:
/Programs/KDE3.5.10_4/include/lcms.h: In function 'void* _cmsMalloc(size_t)':
/Programs/KDE3.5.10_4/include/lcms.h:1418: warning: comparison of unsigned expression < 0 is always false
kis_png_converter.cc: In member function 'KisImageBuilder_Result KisPNGConverter::decode(const KURL&)':
kis_png_converter.cc:165: error: 'png_check_sig' was not declared in this scope
kis_png_converter.cc: In member function 'KisImageBuilder_Result KisPNGConverter::buildFile(const KURL&, KisPaintLayerSP, KSharedPtr<KisAnnotation>*, KSharedPtr<KisAnnotation>*, int, bool, bool)':
kis_png_converter.cc:643: warning: deprecated conversion from string constant to 'char*'
kis_png_converter.cc:649: warning: deprecated conversion from string constant to 'char*'
kis_png_converter.cc:656: warning: deprecated conversion from string constant to 'char*'
kis_png_converter.cc: In member function 'void KisPNGConverter::progress(png_struct*, png_uint_32, int)':
kis_png_converter.cc:788: error: 'PNG_MAX_UINT' was not declared in this scope
gmake[4]: *** [kis_png_converter.lo] Error 1
gmake[4]: Leaving directory `/usr/ports/editors/koffice-kde3/work/koffice-1.6.3/filters/krita/png'
gmake[3]: *** [all-recursive] Error 1
gmake[3]: Leaving directory `/usr/ports/editors/koffice-kde3/work/koffice-1.6.3/filters/krita'
gmake[2]: *** [all-recursive] Error 1
gmake[2]: Leaving directory `/usr/ports/editors/koffice-kde3/work/koffice-1.6.3/filters'
gmake[1]: *** [all-recursive] Error 1
gmake[1]: Leaving directory `/usr/ports/editors/koffice-kde3/work/koffice-1.6.3'
gmake: *** [all] Error 2
*** Error code 1

Stop in /usr/ports/editors/koffice-kde3.
*** Error code 1

Stop in /usr/ports/x11/kde3.
ERROR: 2.1 Build failed of x11/kde3/!!!


More information about the Pbibuild mailing list