[Pbibuild] PBI-7 Autobuild (amd64): x11-wm/enlightenment/

Build 7x64 root at build7x64.pcbsd.org
Mon Mar 29 22:10:11 PDT 2010


PBI Autobuild results for module x11-wm/enlightenment/:
Status: Failed

View Folder:
ftp://ftp.pcbsd.org/pub/pbioutgoing/x64/7/x11-wm/enlightenment//

File listing:
-rwxr-xr-x  1 root  wheel  42941536 Mar  7 09:22 Enlightenment0.16.999.042_4-PV0.pbi
-rw-r--r--  1 root  wheel        77 Mar 30 05:10 Enlightenment0.16.999.042_4-PV0.pbi.md5
-rw-r--r--  1 root  wheel    323020 Mar 30 05:10 build.log.bz2
-rw-r--r--  1 root  wheel         0 Mar  7 09:22 build.time
-rw-r--r--  1 root  wheel        16 Mar  7 09:22 mdate

PBI MD5:
MD5 (Enlightenment0.16.999.042_4-PV0.pbi) = 5321cad56c1bbc5e352fe566c6eb60a7


Last 50 lines of build.log
---------------------------------------------------
gmake[3]: Nothing to be done for `all'.
gmake[3]: Leaving directory `/usr/ports/x11-wm/enlightenment/work/enlightenment-0.16.999.042/src/preload'
gmake[3]: Entering directory `/usr/ports/x11-wm/enlightenment/work/enlightenment-0.16.999.042/src'
gmake[3]: Nothing to be done for `all-am'.
gmake[3]: Leaving directory `/usr/ports/x11-wm/enlightenment/work/enlightenment-0.16.999.042/src'
gmake[2]: Leaving directory `/usr/ports/x11-wm/enlightenment/work/enlightenment-0.16.999.042/src'
Making all in data
gmake[2]: Entering directory `/usr/ports/x11-wm/enlightenment/work/enlightenment-0.16.999.042/data'
Making all in fonts
gmake[3]: Entering directory `/usr/ports/x11-wm/enlightenment/work/enlightenment-0.16.999.042/data/fonts'
gmake[3]: Nothing to be done for `all'.
gmake[3]: Leaving directory `/usr/ports/x11-wm/enlightenment/work/enlightenment-0.16.999.042/data/fonts'
Making all in images
gmake[3]: Entering directory `/usr/ports/x11-wm/enlightenment/work/enlightenment-0.16.999.042/data/images'
gmake[3]: Nothing to be done for `all'.
gmake[3]: Leaving directory `/usr/ports/x11-wm/enlightenment/work/enlightenment-0.16.999.042/data/images'
Making all in init
gmake[3]: Entering directory `/usr/ports/x11-wm/enlightenment/work/enlightenment-0.16.999.042/data/init'
Making all in images
gmake[4]: Entering directory `/usr/ports/x11-wm/enlightenment/work/enlightenment-0.16.999.042/data/init/images'
gmake[4]: Nothing to be done for `all'.
gmake[4]: Leaving directory `/usr/ports/x11-wm/enlightenment/work/enlightenment-0.16.999.042/data/init/images'
gmake[4]: Entering directory `/usr/ports/x11-wm/enlightenment/work/enlightenment-0.16.999.042/data/init'
gmake[4]: Nothing to be done for `all-am'.
gmake[4]: Leaving directory `/usr/ports/x11-wm/enlightenment/work/enlightenment-0.16.999.042/data/init'
gmake[3]: Leaving directory `/usr/ports/x11-wm/enlightenment/work/enlightenment-0.16.999.042/data/init'
Making all in themes
gmake[3]: Entering directory `/usr/ports/x11-wm/enlightenment/work/enlightenment-0.16.999.042/data/themes'
Making all in images
gmake[4]: Entering directory `/usr/ports/x11-wm/enlightenment/work/enlightenment-0.16.999.042/data/themes/images'
gmake[4]: Nothing to be done for `all'.
gmake[4]: Leaving directory `/usr/ports/x11-wm/enlightenment/work/enlightenment-0.16.999.042/data/themes/images'
gmake[4]: Entering directory `/usr/ports/x11-wm/enlightenment/work/enlightenment-0.16.999.042/data/themes'
/Programs/Enlightenment0.16.999.042_5/bin/edje_cc -v -id ../../data/themes/images -fd ../../data/fonts -DLOWRES_PDA=1 -DMEDIUMRES_PDA=2 -DHIRES_PDA=3 -DSLOW_PC=4 -DMEDIUM_PC=5 -DFAST_PC=6 -DE17_PROFILE=SLOW_PC \
	../../data/themes/default.edc \
	../../data/themes/default.edj
/libexec/ld-elf.so.1: /Programs/Enlightenment0.16.999.042_5/lib/evas/modules/loaders/png/freebsd7.2-amd64/module.so: Undefined symbol "png_check_sig"
gmake[4]: *** [default.edj] Error 1
gmake[4]: Leaving directory `/usr/ports/x11-wm/enlightenment/work/enlightenment-0.16.999.042/data/themes'
gmake[3]: *** [all-recursive] Error 1
gmake[3]: Leaving directory `/usr/ports/x11-wm/enlightenment/work/enlightenment-0.16.999.042/data/themes'
gmake[2]: *** [all-recursive] Error 1
gmake[2]: Leaving directory `/usr/ports/x11-wm/enlightenment/work/enlightenment-0.16.999.042/data'
gmake[1]: *** [all-recursive] Error 1
gmake[1]: Leaving directory `/usr/ports/x11-wm/enlightenment/work/enlightenment-0.16.999.042'
gmake: *** [all] Error 2
*** Error code 1

Stop in /usr/ports/x11-wm/enlightenment.
ERROR: 2.1 Build failed of x11-wm/enlightenment/!!!


More information about the Pbibuild mailing list