[Pbibuild] PBI-7 Autobuild (i386): games/wesnoth/

Build 7x32 root at build7x32.pcbsd.org
Sun Mar 28 15:14:01 PDT 2010


PBI Autobuild results for module games/wesnoth/:
Status: Failed

View Folder:
ftp://ftp.pcbsd.org/pub/pbioutgoing/i386/7/games/wesnoth//

File listing:
-rwxr-xr-x  1 root  wheel  230032522 Feb 13 21:36 Wesnoth1.6.5_2-PV0.pbi
-rw-r--r--  1 root  wheel         64 Mar 28 22:13 Wesnoth1.6.5_2-PV0.pbi.md5
-rw-r--r--  1 root  wheel     411963 Mar 28 22:13 build.log.bz2
-rw-r--r--  1 root  wheel          0 Feb 13 21:36 build.time
-rw-r--r--  1 root  wheel          7 Feb  9 19:15 dirstatus
-rw-r--r--  1 root  wheel         16 Feb 13 21:36 mdate

PBI MD5:
MD5 (Wesnoth1.6.5_2-PV0.pbi) = 876ebf45c13833db083901859e03e2af


Last 50 lines of build.log
---------------------------------------------------
gmake[3]: Entering directory `/usr/ports/games/wesnoth/work/wesnoth-1.6.5/po/wesnoth-trow'
gmake[3]: Nothing to be done for `all'.
gmake[3]: Leaving directory `/usr/ports/games/wesnoth/work/wesnoth-1.6.5/po/wesnoth-trow'
Making all in wesnoth-tsg
gmake[3]: Entering directory `/usr/ports/games/wesnoth/work/wesnoth-1.6.5/po/wesnoth-tsg'
gmake[3]: Nothing to be done for `all'.
gmake[3]: Leaving directory `/usr/ports/games/wesnoth/work/wesnoth-1.6.5/po/wesnoth-tsg'
Making all in wesnoth-utbs
gmake[3]: Entering directory `/usr/ports/games/wesnoth/work/wesnoth-1.6.5/po/wesnoth-utbs'
gmake[3]: Nothing to be done for `all'.
gmake[3]: Leaving directory `/usr/ports/games/wesnoth/work/wesnoth-1.6.5/po/wesnoth-utbs'
gmake[3]: Entering directory `/usr/ports/games/wesnoth/work/wesnoth-1.6.5/po'
gmake[3]: Nothing to be done for `all-am'.
gmake[3]: Leaving directory `/usr/ports/games/wesnoth/work/wesnoth-1.6.5/po'
gmake[2]: Leaving directory `/usr/ports/games/wesnoth/work/wesnoth-1.6.5/po'
Making all in m4
gmake[2]: Entering directory `/usr/ports/games/wesnoth/work/wesnoth-1.6.5/m4'
gmake[2]: Nothing to be done for `all'.
gmake[2]: Leaving directory `/usr/ports/games/wesnoth/work/wesnoth-1.6.5/m4'
Making all in src
svnversion: not found
svnversion: not found
svnversion: not found
gmake[2]: Entering directory `/usr/ports/games/wesnoth/work/wesnoth-1.6.5/src'
if [ "" = "" ] || [ "" = "exported" ]; then echo '' >/tmp/westemp$$; \
	else echo '#define REVISION    ""' >/tmp/westemp$$; fi;\
	if cmp -s revision.hpp /tmp/westemp$$ 2>/dev/null; then :; else cp /tmp/westemp$$ revision.hpp; fi; \
	if [ -e /tmp/westemp$$ ]; then rm /tmp/westemp$$; fi
rm -f libwesnoth.a
ar cru libwesnoth.a astarnode.o astarsearch.o builder.o cavegen.o clipboard.o construct_dialog.o cursor.o display.o events.o filechooser.o font.o hotkeys.o image.o image_function.o key.o language.o loadscreen.o map_create.o map_label.o mapgen.o mapgen_dialog.o marked-up_text.o minimap.o pathutils.o preferences.o preferences_display.o race.o random.o reports.o sdl_utils.o show_dialog.o sound.o soundsource.o terrain.o terrain_translation.o time_of_day.o video.o theme.o widgets/button.o widgets/file_menu.o widgets/label.o widgets/menu.o widgets/menu_style.o widgets/progressbar.o widgets/scrollarea.o widgets/scrollbar.o widgets/slider.o widgets/textbox.o widgets/widget.o wml_exception.o 
depbase=`echo tools/exploder_utils.o | sed 's|[^/]*$|.deps/&|;s|\.o$||'`;\
	c++ -DHAVE_CONFIG_H -I. -I..   -I/Programs/Wesnoth1.6.5_3/include -I/usr/include -D_THREAD_SAFE -I/Programs/Wesnoth1.6.5_3/include/pango-1.0 -I/Programs/Wesnoth1.6.5_3/include/cairo -I/Programs/Wesnoth1.6.5_3/include/glib-2.0 -I/Programs/Wesnoth1.6.5_3/lib/glib-2.0/include -I/Programs/Wesnoth1.6.5_3/include/pixman-1 -I/Programs/Wesnoth1.6.5_3/include/freetype2 -I/Programs/Wesnoth1.6.5_3/include   -I/Programs/Wesnoth1.6.5_3/include   -DHAVE_REVISION -I../intl -I../intl -I/Programs/Wesnoth1.6.5_3/include/SDL -I/Programs/Wesnoth1.6.5_3/include -D_GNU_SOURCE=1 -D_REENTRANT  -DWESNOTH_PATH=\"/Programs/Wesnoth1.6.5_3/share/wesnoth\" -DLOCALEDIR=\"/Programs/Wesnoth1.6.5_3/share/locale\" -DHAS_RELATIVE_LOCALEDIR=0 -DFIFODIR=\"/var/run/wesnothd\" -DWESNOTH_PREFIX=\"/Programs/Wesnoth1.6.5_3\" -O2 -W -Wall -ansi -O2 -fno-strict-aliasing -pipe -DDISABLE_POOL_ALLOC  -DHAVE_FRIBIDI -I/Programs/Wesnoth1.6.5_3/include/fribidi -I/Programs/Wesnoth1.6.5_3/include   -D_X11     -I/usr/local/inc!
 lude -MT tools/exploder_utils.o -MD -MP -MF $depbase.Tpo -c -o tools/exploder_utils.o tools/exploder_utils.cpp &&\
	mv -f $depbase.Tpo $depbase.Po
ranlib libwesnoth.a
depbase=`echo tools/exploder_cutter.o | sed 's|[^/]*$|.deps/&|;s|\.o$||'`;\
	c++ -DHAVE_CONFIG_H -I. -I..   -I/Programs/Wesnoth1.6.5_3/include -I/usr/include -D_THREAD_SAFE -I/Programs/Wesnoth1.6.5_3/include/pango-1.0 -I/Programs/Wesnoth1.6.5_3/include/cairo -I/Programs/Wesnoth1.6.5_3/include/glib-2.0 -I/Programs/Wesnoth1.6.5_3/lib/glib-2.0/include -I/Programs/Wesnoth1.6.5_3/include/pixman-1 -I/Programs/Wesnoth1.6.5_3/include/freetype2 -I/Programs/Wesnoth1.6.5_3/include   -I/Programs/Wesnoth1.6.5_3/include   -DHAVE_REVISION -I../intl -I../intl -I/Programs/Wesnoth1.6.5_3/include/SDL -I/Programs/Wesnoth1.6.5_3/include -D_GNU_SOURCE=1 -D_REENTRANT  -DWESNOTH_PATH=\"/Programs/Wesnoth1.6.5_3/share/wesnoth\" -DLOCALEDIR=\"/Programs/Wesnoth1.6.5_3/share/locale\" -DHAS_RELATIVE_LOCALEDIR=0 -DFIFODIR=\"/var/run/wesnothd\" -DWESNOTH_PREFIX=\"/Programs/Wesnoth1.6.5_3\" -O2 -W -Wall -ansi -O2 -fno-strict-aliasing -pipe -DDISABLE_POOL_ALLOC  -DHAVE_FRIBIDI -I/Programs/Wesnoth1.6.5_3/include/fribidi -I/Programs/Wesnoth1.6.5_3/include   -D_X11     -I/usr/local/inc!
 lude -MT tools/exploder_cutter.o -MD -MP -MF $depbase.Tpo -c -o tools/exploder_cutter.o tools/exploder_cutter.cpp &&\
	mv -f $depbase.Tpo $depbase.Po
tools/exploder_utils.cpp: In function 'void save_image(surface, const std::string&)':
tools/exploder_utils.cpp:177: error: 'png_voidp_NULL' was not declared in this scope
tools/exploder_utils.cpp:178: error: 'png_error_ptr_NULL' was not declared in this scope
gmake[2]: *** [tools/exploder_utils.o] Error 1
gmake[2]: *** Waiting for unfinished jobs....
gmake[2]: Leaving directory `/usr/ports/games/wesnoth/work/wesnoth-1.6.5/src'
gmake[1]: *** [all-recursive] Error 1
gmake[1]: Leaving directory `/usr/ports/games/wesnoth/work/wesnoth-1.6.5'
gmake: *** [all] Error 2
*** Error code 1

Stop in /usr/ports/games/wesnoth.
ERROR: 2.1 Build failed of games/wesnoth/!!!


More information about the Pbibuild mailing list