[Pbibuild] PBI-7 Autobuild (i386): games/flightgear/

Build 7x32 root at build7x32.pcbsd.org
Mon Mar 8 21:46:45 PST 2010


PBI Autobuild results for module games/flightgear/:
Status: Failed

View Folder:
ftp://ftp.pcbsd.org/pub/pbioutgoing/i386/7/games/flightgear//

File listing:
-rwxr-xr-x  1 root  wheel  238252982 Feb 27 02:14 FlightGear1.9.1_5-PV0.pbi
-rw-r--r--  1 root  wheel         67 Mar  9 05:46 FlightGear1.9.1_5-PV0.pbi.md5
-rw-r--r--  1 root  wheel     370908 Mar  9 05:46 build.log.bz2
-rw-r--r--  1 root  wheel          0 Mar  8 20:03 build.time
-rw-r--r--  1 root  wheel         16 Feb 27 02:15 mdate

PBI MD5:
MD5 (FlightGear1.9.1_5-PV0.pbi) = 4335e6a4a52279b5b2c6c4f2019f7d53


Last 50 lines of build.log
---------------------------------------------------
folder_open.xpm:52: warning: deprecated conversion from string constant to 'char*'
if c++ -DHAVE_CONFIG_H -I. -I. -I.   -I/usr/local/include   -I/Programs/FlightGear2.0.0/include -DLOCALEDIR=\"/Programs/FlightGear2.0.0/share/locale\" -O2 -fno-strict-aliasing -pipe -MT wizard_funcs.o -MD -MP -MF ".deps/wizard_funcs.Tpo" -c -o wizard_funcs.o wizard_funcs.cxx; \
	then mv -f ".deps/wizard_funcs.Tpo" ".deps/wizard_funcs.Po"; else rm -f ".deps/wizard_funcs.Tpo"; exit 1; fi
wizard_funcs.cxx:112: error: variable or field 'sgMakeOffsetsMatrix' declared void
wizard_funcs.cxx:112: error: 'sgMat4' was not declared in this scope
wizard_funcs.cxx:112: error: 'result' was not declared in this scope
wizard_funcs.cxx:112: error: expected primary-expression before 'double'
wizard_funcs.cxx:112: error: expected primary-expression before 'double'
wizard_funcs.cxx:112: error: expected primary-expression before 'double'
wizard_funcs.cxx:113: error: expected primary-expression before 'double'
wizard_funcs.cxx:113: error: expected primary-expression before 'double'
wizard_funcs.cxx:113: error: expected primary-expression before 'double'
wizard_funcs.cxx: In function 'osg::Node* loadModel(const std::string&, const std::string&, const SGPath&)':
wizard_funcs.cxx:471: error: 'SG_DEGREES_TO_RADIANS' was not declared in this scope
gmake[2]: *** [wizard_funcs.o] Error 1
gmake[2]: Leaving directory `/usr/ports/games/fgrun/work/fgrun-1.5.1/src'
gmake[1]: *** [all] Error 2
gmake[1]: Leaving directory `/usr/ports/games/fgrun/work/fgrun-1.5.1/src'
gmake: *** [all-recursive] Error 1
*** Error code 1

Stop in /usr/ports/games/fgrun.
===>  Building for fgrun-1.5.1_4
Making all in src
gmake[1]: Entering directory `/usr/ports/games/fgrun/work/fgrun-1.5.1/src'
gmake  all-am
gmake[2]: Entering directory `/usr/ports/games/fgrun/work/fgrun-1.5.1/src'
if c++ -DHAVE_CONFIG_H -I. -I. -I.   -I/usr/local/include   -I/Programs/FlightGear2.0.0/include -DLOCALEDIR=\"/Programs/FlightGear2.0.0/share/locale\" -O2 -fno-strict-aliasing -pipe -MT wizard_funcs.o -MD -MP -MF ".deps/wizard_funcs.Tpo" -c -o wizard_funcs.o wizard_funcs.cxx; \
	then mv -f ".deps/wizard_funcs.Tpo" ".deps/wizard_funcs.Po"; else rm -f ".deps/wizard_funcs.Tpo"; exit 1; fi
wizard_funcs.cxx:112: error: variable or field 'sgMakeOffsetsMatrix' declared void
wizard_funcs.cxx:112: error: 'sgMat4' was not declared in this scope
wizard_funcs.cxx:112: error: 'result' was not declared in this scope
wizard_funcs.cxx:112: error: expected primary-expression before 'double'
wizard_funcs.cxx:112: error: expected primary-expression before 'double'
wizard_funcs.cxx:112: error: expected primary-expression before 'double'
wizard_funcs.cxx:113: error: expected primary-expression before 'double'
wizard_funcs.cxx:113: error: expected primary-expression before 'double'
wizard_funcs.cxx:113: error: expected primary-expression before 'double'
wizard_funcs.cxx: In function 'osg::Node* loadModel(const std::string&, const std::string&, const SGPath&)':
wizard_funcs.cxx:471: error: 'SG_DEGREES_TO_RADIANS' was not declared in this scope
gmake[2]: *** [wizard_funcs.o] Error 1
gmake[2]: Leaving directory `/usr/ports/games/fgrun/work/fgrun-1.5.1/src'
gmake[1]: *** [all] Error 2
gmake[1]: Leaving directory `/usr/ports/games/fgrun/work/fgrun-1.5.1/src'
gmake: *** [all-recursive] Error 1
*** Error code 1

Stop in /usr/ports/games/fgrun.
OTHERPORT: Build failed on /usr/ports/games/fgrun
ERROR: 2.1 Build failed of games/flightgear/!!!


More information about the Pbibuild mailing list