[Pbibuild] PBI-7 Autobuild (i386): games/freeorion/

Build 7x32 root at build7x32.pcbsd.org
Sun Jun 20 03:30:10 PDT 2010


PBI Autobuild results for module games/freeorion/:
Status: Failed

View Folder:
ftp://ftp.pcbsd.org/pub/pbioutgoing/i386/7/games/freeorion//

File listing:
-rwxr-xr-x  1 root  wheel  220000787 Apr  9 17:02 FreeOrion0.3.13.3318_4-PV0.pbi
-rw-r--r--  1 root  wheel         72 Jun 20 10:30 FreeOrion0.3.13.3318_4-PV0.pbi.md5
-rw-r--r--  1 root  wheel     611911 Jun 20 10:29 build.log.bz2
-rw-r--r--  1 root  wheel          0 Jun 10 06:22 build.time
-rw-r--r--  1 root  wheel          7 Feb  9 19:15 dirstatus
-rw-r--r--  1 root  wheel         16 Apr  9 17:02 mdate

PBI MD5:
MD5 (FreeOrion0.3.13.3318_4-PV0.pbi) = a5c3cd0fb8b0215307736ef641723b33


Last 50 lines of build.log
---------------------------------------------------
src/Font.cpp:1152: error: 'struct<unnamed>::FTLibraryWrapper' has no member named 'm_library'
src/Font.cpp:1153: error: 'FT_New_Memory_Face' was not declared in this scope
src/Font.cpp: In member function 'void GG::Font::CheckFace(FT_FaceRec_*, FT_Error)':
src/Font.cpp:1160: error: 'FT_IS_SCALABLE' was not declared in this scope
src/Font.cpp: In member function 'void GG::Font::Init(FT_FaceRec_*&)':
src/Font.cpp:1171: error: 'FT_Fixed' was not declared in this scope
src/Font.cpp:1171: error: expected ';' before 'scale'
src/Font.cpp:1179: error: 'FT_Set_Char_Size' was not declared in this scope
src/Font.cpp:1183: error: 'scale' was not declared in this scope
src/Font.cpp:1183: error: invalid use of incomplete type 'struct FT_FaceRec_'
./GG/Font.h:47: error: forward declaration of 'struct FT_FaceRec_'
src/Font.cpp:1184: error: invalid use of incomplete type 'struct FT_FaceRec_'
./GG/Font.h:47: error: forward declaration of 'struct FT_FaceRec_'
src/Font.cpp:1185: error: invalid use of incomplete type 'struct FT_FaceRec_'
./GG/Font.h:47: error: forward declaration of 'struct FT_FaceRec_'
src/Font.cpp:1187: error: invalid use of incomplete type 'struct FT_FaceRec_'
./GG/Font.h:47: error: forward declaration of 'struct FT_FaceRec_'
src/Font.cpp:1189: error: invalid use of incomplete type 'struct FT_FaceRec_'
./GG/Font.h:47: error: forward declaration of 'struct FT_FaceRec_'
src/Font.cpp:1189: error: 'FT_MulFix' was not declared in this scope
src/Font.cpp:1190: error: invalid use of incomplete type 'struct FT_FaceRec_'
./GG/Font.h:47: error: forward declaration of 'struct FT_FaceRec_'
src/Font.cpp:1239: error: expected initializer before '&' token
src/Font.cpp:1241: error: 'glyph_bitmap' was not declared in this scope
src/Font.cpp:1262: error: 'glyph_bitmap' was not declared in this scope
src/Font.cpp:1265: error: invalid use of incomplete type 'struct FT_FaceRec_'
./GG/Font.h:47: error: forward declaration of 'struct FT_FaceRec_'
src/Font.cpp:1283: error: invalid use of incomplete type 'struct FT_FaceRec_'
./GG/Font.h:47: error: forward declaration of 'struct FT_FaceRec_'
src/Font.cpp:1284: error: invalid use of incomplete type 'struct FT_FaceRec_'
./GG/Font.h:47: error: forward declaration of 'struct FT_FaceRec_'
src/Font.cpp: In member function 'bool GG::Font::GenerateGlyph(FT_FaceRec_*, uint32_t)':
src/Font.cpp:1328: error: 'FT_UInt' was not declared in this scope
src/Font.cpp:1328: error: expected ';' before 'index'
src/Font.cpp:1330: error: 'FT_LOAD_DEFAULT' was not declared in this scope
src/Font.cpp:1330: error: 'FT_Load_Glyph' was not declared in this scope
src/Font.cpp:1333: error: 'FT_GlyphSlot' was not declared in this scope
src/Font.cpp:1333: error: expected ';' before 'glyph'
src/Font.cpp:1336: error: 'glyph' was not declared in this scope
src/Font.cpp:1336: error: 'ft_render_mode_normal' was not declared in this scope
src/Font.cpp:1336: error: 'FT_Render_Glyph' was not declared in this scope
scons: *** [src/Font.os] Error 1
scons: building terminated because of errors.
*** Error code 2

Stop in /usr/ports/x11-toolkits/gigi.
*** Error code 1

Stop in /usr/ports/games/freeorion.
ERROR: 2.1 Build failed of games/freeorion/!!!


More information about the Pbibuild mailing list