[Pbibuild] PBI-7 Autobuild (amd64): games/freeorion/

Build 7x64 root at build7x64.pcbsd.org
Tue Jun 15 06:29:42 PDT 2010


PBI Autobuild results for module games/freeorion/:
Status: Failed

View Folder:
ftp://ftp.pcbsd.org/pub/pbioutgoing/x64/7/games/freeorion//

File listing:
-rwxr-xr-x  1 root  wheel  145006463 Apr  8 09:17 FreeOrion0.3.13.3318_4-PV0.pbi
-rw-r--r--  1 root  wheel         72 Jun 15 13:29 FreeOrion0.3.13.3318_4-PV0.pbi.md5
-rw-r--r--  1 root  wheel     621003 Jun 15 13:29 build.log.bz2
-rw-r--r--  1 kris  wheel          0 Jun 10 19:11 build.time
-rw-r--r--  1 kris  wheel          7 Dec 31 18:11 dirstatus
-rw-r--r--  1 kris  wheel         16 Apr  8 09:17 mdate

PBI MD5:
MD5 (FreeOrion0.3.13.3318_4-PV0.pbi) = 28006c5f9ff8dcc137b2cf3bdfac481b


Last 50 lines of build.log
---------------------------------------------------
src/Font.cpp:1152: error: 'struct<unnamed>::FTLibraryWrapper' has no member named 'm_library'
src/Font.cpp:1153: error: 'FT_New_Memory_Face' was not declared in this scope
src/Font.cpp: In member function 'void GG::Font::CheckFace(FT_FaceRec_*, FT_Error)':
src/Font.cpp:1160: error: 'FT_IS_SCALABLE' was not declared in this scope
src/Font.cpp: In member function 'void GG::Font::Init(FT_FaceRec_*&)':
src/Font.cpp:1171: error: 'FT_Fixed' was not declared in this scope
src/Font.cpp:1171: error: expected ';' before 'scale'
src/Font.cpp:1179: error: 'FT_Set_Char_Size' was not declared in this scope
src/Font.cpp:1183: error: 'scale' was not declared in this scope
src/Font.cpp:1183: error: invalid use of incomplete type 'struct FT_FaceRec_'
./GG/Font.h:47: error: forward declaration of 'struct FT_FaceRec_'
src/Font.cpp:1184: error: invalid use of incomplete type 'struct FT_FaceRec_'
./GG/Font.h:47: error: forward declaration of 'struct FT_FaceRec_'
src/Font.cpp:1185: error: invalid use of incomplete type 'struct FT_FaceRec_'
./GG/Font.h:47: error: forward declaration of 'struct FT_FaceRec_'
src/Font.cpp:1187: error: invalid use of incomplete type 'struct FT_FaceRec_'
./GG/Font.h:47: error: forward declaration of 'struct FT_FaceRec_'
src/Font.cpp:1189: error: invalid use of incomplete type 'struct FT_FaceRec_'
./GG/Font.h:47: error: forward declaration of 'struct FT_FaceRec_'
src/Font.cpp:1189: error: 'FT_MulFix' was not declared in this scope
src/Font.cpp:1190: error: invalid use of incomplete type 'struct FT_FaceRec_'
./GG/Font.h:47: error: forward declaration of 'struct FT_FaceRec_'
src/Font.cpp:1239: error: expected initializer before '&' token
src/Font.cpp:1241: error: 'glyph_bitmap' was not declared in this scope
src/Font.cpp:1262: error: 'glyph_bitmap' was not declared in this scope
src/Font.cpp:1265: error: invalid use of incomplete type 'struct FT_FaceRec_'
./GG/Font.h:47: error: forward declaration of 'struct FT_FaceRec_'
src/Font.cpp:1283: error: invalid use of incomplete type 'struct FT_FaceRec_'
./GG/Font.h:47: error: forward declaration of 'struct FT_FaceRec_'
src/Font.cpp:1284: error: invalid use of incomplete type 'struct FT_FaceRec_'
./GG/Font.h:47: error: forward declaration of 'struct FT_FaceRec_'
src/Font.cpp: In member function 'bool GG::Font::GenerateGlyph(FT_FaceRec_*, uint32_t)':
src/Font.cpp:1328: error: 'FT_UInt' was not declared in this scope
src/Font.cpp:1328: error: expected ';' before 'index'
src/Font.cpp:1330: error: 'FT_LOAD_DEFAULT' was not declared in this scope
src/Font.cpp:1330: error: 'FT_Load_Glyph' was not declared in this scope
src/Font.cpp:1333: error: 'FT_GlyphSlot' was not declared in this scope
src/Font.cpp:1333: error: expected ';' before 'glyph'
src/Font.cpp:1336: error: 'glyph' was not declared in this scope
src/Font.cpp:1336: error: 'ft_render_mode_normal' was not declared in this scope
src/Font.cpp:1336: error: 'FT_Render_Glyph' was not declared in this scope
scons: *** [src/Font.os] Error 1
scons: building terminated because of errors.
*** Error code 2

Stop in /usr/ports/x11-toolkits/gigi.
*** Error code 1

Stop in /usr/ports/games/freeorion.
ERROR: 2.1 Build failed of games/freeorion/!!!


More information about the Pbibuild mailing list