[Pbibuild] PBI-7 Autobuild (amd64): mail/evolution/

Build 7x64 root at build7x64.pcbsd.org
Sat Jul 3 02:00:10 PDT 2010


PBI Autobuild results for module mail/evolution/:
Status: Failed

View Folder:
ftp://ftp.pcbsd.org/pub/pbioutgoing/x64/7/mail/evolution//

File listing:
-rwxr-xr-x  1 root  wheel  75436591 Apr 14 18:19 Evolution2.28.2_2-PV0.pbi
-rw-r--r--  1 root  wheel        67 Jul  3 09:00 Evolution2.28.2_2-PV0.pbi.md5
-rw-r--r--  1 root  wheel    530504 Jul  3 09:00 build.log.bz2
-rw-r--r--  1 kris  wheel         0 Jul  1 14:04 build.time
-rw-r--r--  1 kris  wheel         7 Dec 31  2009 dirstatus
-rw-r--r--  1 kris  wheel        16 Apr 14 18:19 mdate

PBI MD5:
MD5 (Evolution2.28.2_2-PV0.pbi) = 59898be115d86af9e6b01101f53e97ed


Last 50 lines of build.log
---------------------------------------------------
===>   evolution-2.30.1.2_3 depends on executable: update-desktop-database - found
===>   evolution-2.30.1.2_3 depends on file: /Programs/Evolution2.30.1.2_3/libdata/pkgconfig/gnome-doc-utils.pc - found
===>   evolution-2.30.1.2_3 depends on file: /Programs/Evolution2.30.1.2_3/libdata/pkgconfig/pygtk-2.0.pc - found
===>   evolution-2.30.1.2_3 depends on shared library: nss3.1 - found
===>   evolution-2.30.1.2_3 depends on shared library: unique-1.0.2 - not found
===>    Verifying install for unique-1.0.2 in /usr/ports/x11-toolkits/unique
===>   unique-1.1.6_1 depends on executable: gmake - found
===>   unique-1.1.6_1 depends on file: /Programs/Evolution2.30.1.2_3/libdata/pkgconfig/ice.pc - found
===>   unique-1.1.6_1 depends on package: libtool>=2.2 - found
===>   unique-1.1.6_1 depends on file: /Programs/Evolution2.30.1.2_3/bin/intltool-extract - found
===>   unique-1.1.6_1 depends on executable: pkg-config - found
===>   unique-1.1.6_1 depends on shared library: dbus-1.3 - not found
===>    Verifying install for dbus-1.3 in /usr/ports/devel/dbus
===>  Building for dbus-1.2.24_1
gmake  all-recursive
gmake[1]: Entering directory `/usr/ports/devel/dbus/work/dbus-1.2.24'
Making all in dbus
gmake[2]: Entering directory `/usr/ports/devel/dbus/work/dbus-1.2.24/dbus'
gmake  all-am
gmake[3]: Entering directory `/usr/ports/devel/dbus/work/dbus-1.2.24/dbus'
gmake[3]: Nothing to be done for `all-am'.
gmake[3]: Leaving directory `/usr/ports/devel/dbus/work/dbus-1.2.24/dbus'
gmake[2]: Leaving directory `/usr/ports/devel/dbus/work/dbus-1.2.24/dbus'
Making all in bus
gmake[2]: Entering directory `/usr/ports/devel/dbus/work/dbus-1.2.24/bus'
gmake[2]: Nothing to be done for `all'.
gmake[2]: Leaving directory `/usr/ports/devel/dbus/work/dbus-1.2.24/bus'
Making all in doc
gmake[2]: Entering directory `/usr/ports/devel/dbus/work/dbus-1.2.24/doc'
gmake[2]: Nothing to be done for `all'.
gmake[2]: Leaving directory `/usr/ports/devel/dbus/work/dbus-1.2.24/doc'
Making all in tools
gmake[2]: Entering directory `/usr/ports/devel/dbus/work/dbus-1.2.24/tools'
  CCLD   dbus-launch
/usr/bin/ld: cannot find -lSM
gmake[2]: *** [dbus-launch] Error 1
gmake[2]: Leaving directory `/usr/ports/devel/dbus/work/dbus-1.2.24/tools'
gmake[1]: *** [all-recursive] Error 1
gmake[1]: Leaving directory `/usr/ports/devel/dbus/work/dbus-1.2.24'
gmake: *** [all] Error 2
*** Error code 1

Stop in /usr/ports/devel/dbus.
*** Error code 1

Stop in /usr/ports/x11-toolkits/unique.
*** Error code 1

Stop in /usr/ports/mail/evolution.
ERROR: 2.1 Build failed of mail/evolution/!!!


More information about the Pbibuild mailing list