[Pbibuild] PBI-8 Autobuild (i386): databases/pgadmin3/

PC-BSD Build8 (i386) root at build8x32.pcbsd.org
Thu Jan 21 02:42:32 PST 2010


PBI Autobuild results for module databases/pgadmin3/:
Status: Failed

View Folder:
ftp://ftp.pcbsd.org/pub/pbioutgoing/x32/8/outgoing/databases/pgadmin3//

File listing:
-rw-r--r--  1 root  wheel    497488 Jan 21 02:42 build.log.bz2
-rw-r--r--  1 root  wheel         0 Jan 20 22:34 build.time
-rw-r--r--  1 root  wheel        16 Dec 12 17:49 mdate
-rwxr-xr-x  1 root  wheel  34198934 Dec 12 17:49 pgAdmin1.10.0_1-PV0.pbi
-rw-r--r--  1 root  wheel        65 Jan 21 02:42 pgAdmin1.10.0_1-PV0.pbi.md5

PBI MD5:
MD5 (pgAdmin1.10.0_1-PV0.pbi) = 9f32109a43ee86034419b114bcdd89f8


Last 50 lines of build.log
---------------------------------------------------
*** Error code 2
1 error
*** Error code 1

Stop in /usr/ports/databases/pgadmin3.
===>  Building for pgadmin3-1.10.1
make  all-recursive
Making all in branding
Making all in i18n
Making all in pgadmin
test -f ./include/svnversion.cpp || touch ./include/svnversion.cpp
test -d ./.svn && ( V=`svnversion ./..` && OV=`cat ./include/svnversion.h | cut -d' ' -f3|tr -d '"'` ; if [ "$V" != "$OV" ]; then echo "#define VERSION_SVN \"$V\"" > ./include/svnversion.h ; fi ) || true
test -f ./include/svnversion.h || echo "#define VERSION_SVN \"unknown\"" > ./include/svnversion.h
c++ -DHAVE_CONFIG_H -I. -I..   -I/Programs/pgAdmin/include -I/Programs/pgAdmin/include -DSSL -I/Programs/pgAdmin/lib/wx/include/gtk2-unicode-release-2.8 -I/Programs/pgAdmin/include/wx-2.8 -D_FILE_OFFSET_BITS=64 -D_LARGE_FILES -D__WXGTK__ -O2 -DEMBED_XRC -I/Programs/pgAdmin/include/libxml2 -I/Programs/pgAdmin/include -I/Programs/pgAdmin/include -I/Programs/pgAdmin/include/libxml2 -DDATA_DIR=\"/Programs/pgAdmin/share/pgadmin3/\" -Wall -Wno-non-virtual-dtor -fno-strict-aliasing -I../pgadmin/include   -MT pgAdmin3.o -MD -MP -MF .deps/pgAdmin3.Tpo -c -o pgAdmin3.o `test -f './pgAdmin3.cpp' || echo './'`./pgAdmin3.cpp
c++ -DHAVE_CONFIG_H -I. -I..   -I/Programs/pgAdmin/include -I/Programs/pgAdmin/include -DSSL -I/Programs/pgAdmin/lib/wx/include/gtk2-unicode-release-2.8 -I/Programs/pgAdmin/include/wx-2.8 -D_FILE_OFFSET_BITS=64 -D_LARGE_FILES -D__WXGTK__ -O2 -DEMBED_XRC -I/Programs/pgAdmin/include/libxml2 -I/Programs/pgAdmin/include -I/Programs/pgAdmin/include -I/Programs/pgAdmin/include/libxml2 -DDATA_DIR=\"/Programs/pgAdmin/share/pgadmin3/\" -Wall -Wno-non-virtual-dtor -fno-strict-aliasing -I../pgadmin/include   -MT dlgJob.o -MD -MP -MF .deps/dlgJob.Tpo -c -o dlgJob.o `test -f './agent/dlgJob.cpp' || echo './'`./agent/dlgJob.cpp
c++ -DHAVE_CONFIG_H -I. -I..   -I/Programs/pgAdmin/include -I/Programs/pgAdmin/include -DSSL -I/Programs/pgAdmin/lib/wx/include/gtk2-unicode-release-2.8 -I/Programs/pgAdmin/include/wx-2.8 -D_FILE_OFFSET_BITS=64 -D_LARGE_FILES -D__WXGTK__ -O2 -DEMBED_XRC -I/Programs/pgAdmin/include/libxml2 -I/Programs/pgAdmin/include -I/Programs/pgAdmin/include -I/Programs/pgAdmin/include/libxml2 -DDATA_DIR=\"/Programs/pgAdmin/share/pgadmin3/\" -Wall -Wno-non-virtual-dtor -fno-strict-aliasing -I../pgadmin/include   -MT dlgSchedule.o -MD -MP -MF .deps/dlgSchedule.Tpo -c -o dlgSchedule.o `test -f './agent/dlgSchedule.cpp' || echo './'`./agent/dlgSchedule.cpp
c++ -DHAVE_CONFIG_H -I. -I..   -I/Programs/pgAdmin/include -I/Programs/pgAdmin/include -DSSL -I/Programs/pgAdmin/lib/wx/include/gtk2-unicode-release-2.8 -I/Programs/pgAdmin/include/wx-2.8 -D_FILE_OFFSET_BITS=64 -D_LARGE_FILES -D__WXGTK__ -O2 -DEMBED_XRC -I/Programs/pgAdmin/include/libxml2 -I/Programs/pgAdmin/include -I/Programs/pgAdmin/include -I/Programs/pgAdmin/include/libxml2 -DDATA_DIR=\"/Programs/pgAdmin/share/pgadmin3/\" -Wall -Wno-non-virtual-dtor -fno-strict-aliasing -I../pgadmin/include   -MT dlgStep.o -MD -MP -MF .deps/dlgStep.Tpo -c -o dlgStep.o `test -f './agent/dlgStep.cpp' || echo './'`./agent/dlgStep.cpp
In file included from ../pgadmin/include/ctl/ctlSQLBox.h:20,
                 from ../pgadmin/include/pgAdmin3.h:23,
                 from ./agent/dlgSchedule.cpp:12:
../pgadmin/include/db/pgConn.h: In static member function 'static bool pgConn::IsValidServerEncoding(int)':
../pgadmin/include/db/pgConn.h:104: error: 'pg_valid_server_encoding_id' was not declared in this scope
In file included from ../pgadmin/include/ctl/ctlSQLBox.h:20,
                 from ../pgadmin/include/pgAdmin3.h:23,
                 from ./agent/dlgStep.cpp:13:
../pgadmin/include/db/pgConn.h: In static member function 'static bool pgConn::IsValidServerEncoding(int)':
../pgadmin/include/db/pgConn.h:104: error: 'pg_valid_server_encoding_id' was not declared in this scope
In file included from ../pgadmin/include/ctl/ctlSQLBox.h:20,
                 from ../pgadmin/include/pgAdmin3.h:23,
                 from ./agent/dlgJob.cpp:14:
../pgadmin/include/db/pgConn.h: In static member function 'static bool pgConn::IsValidServerEncoding(int)':
../pgadmin/include/db/pgConn.h:104: error: 'pg_valid_server_encoding_id' was not declared in this scope
In file included from ../pgadmin/include/ctl/ctlSQLBox.h:20,
                 from ../pgadmin/include/pgAdmin3.h:23,
                 from ./pgAdmin3.cpp:13:
../pgadmin/include/db/pgConn.h: In static member function 'static bool pgConn::IsValidServerEncoding(int)':
../pgadmin/include/db/pgConn.h:104: error: 'pg_valid_server_encoding_id' was not declared in this scope
*** Error code 1
*** Error code 1
*** Error code 1
*** Error code 1
4 errors
*** Error code 1
1 error
*** Error code 2
1 error
*** Error code 1

Stop in /usr/ports/databases/pgadmin3.
ERROR: 2.1 Build failed of databases/pgadmin3/!!!


More information about the Pbibuild mailing list