[Pbibuild] PBI-8 Autobuild (amd64): cad/opencascade/

Build 8x64 root at build8x64.pcbsd.org
Sun Feb 28 15:41:12 PST 2010


PBI Autobuild results for module cad/opencascade/:
Status: Failed

View Folder:
ftp://ftp.pcbsd.org/pub/pbioutgoing/x64/8/cad/opencascade//

File listing:
-rwxr-xr-x  1 root  wheel  231231424 Dec 12 03:43 OpenCascade6.3_6-PV0.pbi
-rw-r--r--  1 root  wheel         66 Feb 28 23:41 OpenCascade6.3_6-PV0.pbi.md5
-rw-r--r--  1 root  wheel     725072 Feb 28 23:40 build.log.bz2
-rw-r--r--  1 root  wheel          0 Feb 28 15:34 build.time
-rw-r--r--  1 root  wheel          7 Feb 10 14:18 dirstatus
-rw-r--r--  1 root  wheel         16 Dec 12 03:43 mdate

PBI MD5:
MD5 (OpenCascade6.3_6-PV0.pbi) = 028c657161da0c4e4c95262bb8f4ac2d


Last 50 lines of build.log
---------------------------------------------------
Compiling filename_expand.cxx...
Compiling filename_ext.cxx...
Compiling filename_isdir.cxx...
Compiling filename_list.cxx...
filename_list.cxx: In function 'int fl_filename_list(const char*, dirent***, int (*)(dirent**, dirent**))':
filename_list.cxx:59: error: invalid conversion from 'int (*)(const dirent**, const dirent**)' to 'int (*)(const void*, const void*)'
filename_list.cxx:59: error:   initializing argument 4 of 'int scandir(const char*, dirent***, int (*)(dirent*), int (*)(const void*, const void*))'
*** Error code 1

Stop in /usr/ports/x11-toolkits/fltk/work/fltk-1.1.9/src.
*** Error code 1

Stop in /usr/ports/x11-toolkits/fltk/work/fltk-1.1.9.
*** Error code 1

Stop in /usr/ports/x11-toolkits/fltk.
*** Error code 1

Stop in /usr/ports/cad/opencascade.
===>   opencascade-6.3_7 depends on file: /Programs/OpenCascade/include/stlport/algorithm - found
===>   opencascade-6.3_7 depends on file: /Programs/OpenCascade/jdk1.6.0/bin/java - found
===>   opencascade-6.3_7 depends on executable: tclsh8.4-threads - found
===>   opencascade-6.3_7 depends on executable: gcc44 - found
===>   opencascade-6.3_7 depends on executable: bison - found
===>   opencascade-6.3_7 depends on file: /Programs/OpenCascade/libdata/pkgconfig/xmu.pc - found
===>   opencascade-6.3_7 depends on package: libtool>=2.2 - found
===>   opencascade-6.3_7 depends on shared library: itcl.3 - found
===>   opencascade-6.3_7 depends on shared library: itk.3 - found
===>   opencascade-6.3_7 depends on shared library: tix8184.1 - found
===>   opencascade-6.3_7 depends on shared library: fltk.1 - not found
===>    Verifying install for fltk.1 in /usr/ports/x11-toolkits/fltk
===>  Building for fltk-1.1.9_2
=== making src ===
Compiling filename_list.cxx...
filename_list.cxx: In function 'int fl_filename_list(const char*, dirent***, int (*)(dirent**, dirent**))':
filename_list.cxx:59: error: invalid conversion from 'int (*)(const dirent**, const dirent**)' to 'int (*)(const void*, const void*)'
filename_list.cxx:59: error:   initializing argument 4 of 'int scandir(const char*, dirent***, int (*)(dirent*), int (*)(const void*, const void*))'
*** Error code 1

Stop in /usr/ports/x11-toolkits/fltk/work/fltk-1.1.9/src.
*** Error code 1

Stop in /usr/ports/x11-toolkits/fltk/work/fltk-1.1.9.
*** Error code 1

Stop in /usr/ports/x11-toolkits/fltk.
*** Error code 1

Stop in /usr/ports/cad/opencascade.
ERROR: 2.1 Build failed of cad/opencascade/!!!


More information about the Pbibuild mailing list