[Pbibuild] PBI-8 Autobuild (i386): cad/opencascade/

Kris Moore kris at build8x32.pcbsd.org
Wed Feb 10 19:27:04 PST 2010


PBI Autobuild results for module cad/opencascade/:
Status: Failed

View Folder:
ftp://ftp.pcbsd.org/pub/pbioutgoing/x32/8/cad/opencascade//

File listing:
-rwxr-xr-x  1 root  wheel  280896934 Dec 12 11:30 OpenCascade6.3_6-PV0.pbi
-rw-r--r--  1 root  wheel         66 Feb 11 03:26 OpenCascade6.3_6-PV0.pbi.md5
-rw-r--r--  1 root  wheel     823723 Feb 11 03:26 build.log.bz2
-rw-r--r--  1 root  wheel          0 Feb  7 11:11 build.time
-rw-r--r--  1 root  wheel          7 Feb 10 13:51 dirstatus
-rw-r--r--  1 root  wheel         16 Dec 12 11:30 mdate

PBI MD5:
MD5 (OpenCascade6.3_6-PV0.pbi) = 6ae8a674be3bc38e09046c02607f9623


Last 50 lines of build.log
---------------------------------------------------
Compiling filename_expand.cxx...
Compiling filename_ext.cxx...
Compiling filename_isdir.cxx...
Compiling filename_list.cxx...
filename_list.cxx: In function 'int fl_filename_list(const char*, dirent***, int (*)(dirent**, dirent**))':
filename_list.cxx:59: error: invalid conversion from 'int (*)(const dirent**, const dirent**)' to 'int (*)(const void*, const void*)'
filename_list.cxx:59: error:   initializing argument 4 of 'int scandir(const char*, dirent***, int (*)(dirent*), int (*)(const void*, const void*))'
*** Error code 1

Stop in /usr/ports/x11-toolkits/fltk/work/fltk-1.1.9/src.
*** Error code 1

Stop in /usr/ports/x11-toolkits/fltk/work/fltk-1.1.9.
*** Error code 1

Stop in /usr/ports/x11-toolkits/fltk.
*** Error code 1

Stop in /usr/ports/cad/opencascade.
===>   opencascade-6.3_7 depends on file: /Programs/OpenCascade/include/stlport/algorithm - found
===>   opencascade-6.3_7 depends on file: /Programs/OpenCascade/jdk1.6.0/bin/java - found
===>   opencascade-6.3_7 depends on executable: tclsh8.4-threads - found
===>   opencascade-6.3_7 depends on executable: gcc44 - found
===>   opencascade-6.3_7 depends on executable: bison - found
===>   opencascade-6.3_7 depends on file: /Programs/OpenCascade/libdata/pkgconfig/xmu.pc - found
===>   opencascade-6.3_7 depends on package: libtool>=2.2 - found
===>   opencascade-6.3_7 depends on shared library: itcl.3 - found
===>   opencascade-6.3_7 depends on shared library: itk.3 - found
===>   opencascade-6.3_7 depends on shared library: tix8184.1 - found
===>   opencascade-6.3_7 depends on shared library: fltk.1 - not found
===>    Verifying install for fltk.1 in /usr/ports/x11-toolkits/fltk
===>  Building for fltk-1.1.9_2
=== making src ===
Compiling filename_list.cxx...
filename_list.cxx: In function 'int fl_filename_list(const char*, dirent***, int (*)(dirent**, dirent**))':
filename_list.cxx:59: error: invalid conversion from 'int (*)(const dirent**, const dirent**)' to 'int (*)(const void*, const void*)'
filename_list.cxx:59: error:   initializing argument 4 of 'int scandir(const char*, dirent***, int (*)(dirent*), int (*)(const void*, const void*))'
*** Error code 1

Stop in /usr/ports/x11-toolkits/fltk/work/fltk-1.1.9/src.
*** Error code 1

Stop in /usr/ports/x11-toolkits/fltk/work/fltk-1.1.9.
*** Error code 1

Stop in /usr/ports/x11-toolkits/fltk.
*** Error code 1

Stop in /usr/ports/cad/opencascade.
ERROR: 2.1 Build failed of cad/opencascade/!!!


More information about the Pbibuild mailing list