[Pbibuild] PBI-8 Autobuild (amd64): devel/qdevelop/

Build 8x64 root at build8x64.pcbsd.org
Thu Apr 29 23:21:55 PDT 2010


PBI Autobuild results for module devel/qdevelop/:
Status: Failed

View Folder:
ftp://ftp.pcbsd.org/pub/pbioutgoing/x64/8/devel/qdevelop//

File listing:
-rwxr-xr-x  1 root  wheel  39299145 Dec 23 12:15 QDevelop0.27.4-PV0.pbi
-rw-r--r--  1 root  wheel        64 Apr 30 06:21 QDevelop0.27.4-PV0.pbi.md5
-rw-r--r--  1 root  wheel     13405 Apr 30 06:21 build.log.bz2
-rw-r--r--  1 root  wheel         0 Apr 30 05:40 build.time
-rw-r--r--  1 root  wheel         7 Feb 10 14:18 dirstatus
-rw-r--r--  1 root  wheel        16 Dec 23 12:15 mdate

PBI MD5:
MD5 (QDevelop0.27.4-PV0.pbi) = 8736fb27f5c808462e1fe393b2148962


Last 50 lines of build.log
---------------------------------------------------
./configure: cannot create /dev/null: Operation not supported
appending configuration tag "F77" to libtool
eval: sed: not found
./configure: rm: not found
configure: error: unable to update list of available tagged configurations.
exit: cat: not found
exit: sed: not found
exit: sort: not found
exit: sed: not found
exit: cat: not found
exit: sort: not found
exit: cat: not found
exit: cat: not found
exit: rm: not found
configure: error: ./configure failed for libasprintf
exit: cat: not found
exit: sed: not found
exit: sort: not found
exit: sed: not found
exit: cat: not found
exit: sort: not found
exit: cat: not found
exit: cat: not found
exit: rm: not found
configure: error: ./configure failed for gettext-runtime
exit: cat: not found
exit: sed: not found
sort: not found
exit: sed: not found
exit: cat: not found
sort: not found
exit: cat: not found
exit: cat: not found
exit: rm: not found
===>  Script "configure" failed unexpectedly.
/usr/bin/fmt: not found
*** Error code 127

Stop in /usr/ports/devel/gettext.
*** Error code 1

Stop in /usr/ports/devel/gmake.
/ppmake.sh: make: not found
/usr/ports/lang/perl5.8
/ppmake.sh: make: not found
/ppmake.sh: make: not found
/ppmake.sh: make: not found
umount: not found
chroot: /makeport.sh: No such file or directory
ERROR: 2.1 Build failed of devel/qdevelop/!!!


More information about the Pbibuild mailing list