[Pbibuild] PBI-8 Autobuild (amd64): net/smb4k/

Build 8x64 root at build8x64.pcbsd.org
Thu Apr 29 19:15:19 PDT 2010


PBI Autobuild results for module net/smb4k/:
Status: Failed

View Folder:
ftp://ftp.pcbsd.org/pub/pbioutgoing/x64/8/net/smb4k//

File listing:
-rwxr-xr-x  1 root  wheel  88506717 Dec 27 16:37 Smb4K0.9.9_2-PV0.pbi
-rw-r--r--  1 root  wheel        62 Apr 30 02:14 Smb4K0.9.9_2-PV0.pbi.md5
-rw-r--r--  1 root  wheel     94186 Apr 30 02:14 build.log.bz2
-rw-r--r--  1 root  wheel         0 Apr 30 01:14 build.time
-rw-r--r--  1 root  wheel         7 Feb 10 14:18 dirstatus
-rw-r--r--  1 root  wheel        16 Dec 27 16:38 mdate

PBI MD5:
MD5 (Smb4K0.9.9_2-PV0.pbi) = 612e0d8e16483692342947c50466bc27


Last 50 lines of build.log
---------------------------------------------------
/Programs/Smb4K/include/iconv.h:167: warning: type defaults to 'int' in declaration of 'wchar_t'
/Programs/Smb4K/include/iconv.h:167: error: expected ';', ',' or ')' before '*' token
/Programs/Smb4K/include/iconv.h:169: error: expected ';', ',' or ')' before 'void'
/Programs/Smb4K/include/iconv.h:176: error: expected ')' before 'code'
/Programs/Smb4K/include/iconv.h:191: error: expected specifier-qualifier-list before 'iconv_wchar_mb_to_wc_fallback'
In file included from /Programs/Smb4K/include/libxml2/libxml/parser.h:802,
                 from /Programs/Smb4K/include/libxml2/libxml/globals.h:18,
                 from /Programs/Smb4K/include/libxml2/libxml/threads.h:35,
                 from /Programs/Smb4K/include/libxml2/libxml/xmlmemory.h:218,
                 from security.c:55:
/Programs/Smb4K/include/libxml2/libxml/xmlIO.h:173: error: expected ')' before '*' token
/Programs/Smb4K/include/libxml2/libxml/xmlIO.h:231: error: expected ')' before '*' token
In file included from /Programs/Smb4K/include/libxml2/libxml/globals.h:20,
                 from /Programs/Smb4K/include/libxml2/libxml/threads.h:35,
                 from /Programs/Smb4K/include/libxml2/libxml/xmlmemory.h:218,
                 from security.c:55:
/Programs/Smb4K/include/libxml2/libxml/SAX.h:16:20: error: stdlib.h: No such file or directory
In file included from security.c:57:
/Programs/Smb4K/include/libxml2/libxml/uri.h:71: error: expected ')' before '*' token
In file included from security.c:60:
xsltutils.h:226: error: expected ')' before '*' token
xsltutils.h:251: error: expected declaration specifiers or '...' before 'FILE'
In file included from security.c:61:
extensions.h:254: error: expected ')' before '*' token
gmake[2]: *** [security.lo] Error 1
gmake[2]: Leaving directory `/usr/ports/textproc/libxslt/work/libxslt-1.1.26/libxslt'
gmake[1]: *** [all-recursive] Error 1
gmake[1]: Leaving directory `/usr/ports/textproc/libxslt/work/libxslt-1.1.26'
gmake: *** [all] Error 2
*** Error code 1

Stop in /usr/ports/textproc/libxslt.
*** Error code 1

Stop in /usr/ports/x11/libxcb.
*** Error code 1

Stop in /usr/ports/x11/libX11.
*** Error code 1

Stop in /usr/ports/x11/libXinerama.
*** Error code 1

Stop in /usr/ports/x11-toolkits/qt33.
*** Error code 1

Stop in /usr/ports/net/smb4k.
/makeport.sh: make: not found
umount: not found
ERROR: 2.1 Build failed of net/smb4k/!!!


More information about the Pbibuild mailing list