[Pbibuild] PBI-8 Autobuild (amd64): security/nessus/

Build 8x64 root at build8x64.pcbsd.org
Thu Apr 29 14:31:23 PDT 2010


PBI Autobuild results for module security/nessus/:
Status: Failed

View Folder:
ftp://ftp.pcbsd.org/pub/pbioutgoing/x64/8/security/nessus//

File listing:
-rw-r--r--  1 root  wheel  51796 Apr 29 21:31 build.log.bz2
-rw-r--r--  1 root  wheel      0 Apr 29 20:31 build.time

PBI MD5:



Last 50 lines of build.log
---------------------------------------------------
*** Error code 1

Stop in /usr/ports/security/nessus-libnasl.
*** Error code 1

Stop in /usr/ports/security/nessus.
===>   nessus-2.2.9_1 depends on shared library: nasl.4 - not found
===>    Verifying install for nasl.4 in /usr/ports/security/nessus-libnasl
===>   nessus-libnasl-2.2.9_1 depends on executable: bison - not found
===>    Verifying install for bison in /usr/ports/devel/bison
===>   bison-2.4.1,1 depends on executable: gm4 - found
===>   bison-2.4.1,1 depends on shared library: intl - not found
===>    Verifying install for intl in /usr/ports/devel/gettext
===>  Building for gettext-0.17_1
Making all in gnulib-local
Making all in gettext-runtime
make  all-recursive
Making all in doc
Making all in intl
/bin/sh /Programs/QDevelop/bin/libtool --mode=compile cc -c -DLOCALEDIR=\"/Programs/QDevelop/share/locale\" -DLOCALE_ALIAS_PATH=\"/Programs/QDevelop/share/locale\"  -DLIBDIR=\"/Programs/QDevelop/libdata\" -DBUILDING_LIBINTL -DBUILDING_DLL -DIN_LIBINTL  -DENABLE_RELOCATABLE=1 -DIN_LIBRARY -DINSTALLDIR=\"/Programs/QDevelop/lib\" -DNO_XMALLOC  -Dset_relocation_prefix=libintl_set_relocation_prefix  -Drelocate=libintl_relocate  -DDEPENDS_ON_LIBICONV=1 -DHAVE_CONFIG_H -I. -I. -I.. -I/Programs/QDevelop/include -O2 -pipe -fno-strict-aliasing -fvisibility=hidden  ./loadmsgcat.c
libtool: compile:  cc -c -DLOCALEDIR=\"/Programs/QDevelop/share/locale\" -DLOCALE_ALIAS_PATH=\"/Programs/QDevelop/share/locale\" -DLIBDIR=\"/Programs/QDevelop/libdata\" -DBUILDING_LIBINTL -DBUILDING_DLL -DIN_LIBINTL -DENABLE_RELOCATABLE=1 -DIN_LIBRARY -DINSTALLDIR=\"/Programs/QDevelop/lib\" -DNO_XMALLOC -Dset_relocation_prefix=libintl_set_relocation_prefix -Drelocate=libintl_relocate -DDEPENDS_ON_LIBICONV=1 -DHAVE_CONFIG_H -I. -I. -I.. -I/Programs/QDevelop/include -O2 -pipe -fno-strict-aliasing -fvisibility=hidden ./loadmsgcat.c  -fPIC -DPIC -o .libs/loadmsgcat.o
./loadmsgcat.c: In function 'get_sysdep_segment_value':
./loadmsgcat.c:728: error: 'uintmax_t' undeclared (first use in this function)
./loadmsgcat.c:728: error: (Each undeclared identifier is reported only once
./loadmsgcat.c:728: error: for each function it appears in.)
*** Error code 1

Stop in /usr/ports/devel/gettext/work/gettext-0.17/gettext-runtime/intl.
*** Error code 1

Stop in /usr/ports/devel/gettext/work/gettext-0.17/gettext-runtime.
*** Error code 1

Stop in /usr/ports/devel/gettext/work/gettext-0.17/gettext-runtime.
*** Error code 1

Stop in /usr/ports/devel/gettext/work/gettext-0.17.
*** Error code 1

Stop in /usr/ports/devel/gettext.
*** Error code 1

Stop in /usr/ports/devel/bison.
*** Error code 1

Stop in /usr/ports/security/nessus-libnasl.
*** Error code 1

Stop in /usr/ports/security/nessus.
ERROR: 2.1 Build failed of security/nessus/!!!


More information about the Pbibuild mailing list