[Pbibuild] PBI-8 Autobuild (amd64): security/nessus/

Build 8x64 root at build8x64.pcbsd.org
Wed Apr 28 19:43:17 PDT 2010


PBI Autobuild results for module security/nessus/:
Status: Failed

View Folder:
ftp://ftp.pcbsd.org/pub/pbioutgoing/x64/8/security/nessus//

File listing:
-rw-r--r--  1 root  wheel  97696 Apr 29 02:43 build.log.bz2
-rw-r--r--  1 root  wheel      0 Apr 29 01:31 build.time

PBI MD5:



Last 50 lines of build.log
---------------------------------------------------
mv -f .deps/xcb_out.Tpo .deps/xcb_out.Plo
/bin/sh ../libtool --tag=CC   --mode=compile cc -DHAVE_CONFIG_H -I.    -Wall -pedantic -Wpointer-arith 		-Wstrict-prototypes -Wmissing-declarations -Wnested-externs -I/Programs/Nessus/include -I/Programs/Nessus/include -O2 -pipe -fno-strict-aliasing -MT xcb_in.lo -MD -MP -MF .deps/xcb_in.Tpo -c -o xcb_in.lo xcb_in.c
libtool: compile:  cc -DHAVE_CONFIG_H -I. -Wall -pedantic -Wpointer-arith -Wstrict-prototypes -Wmissing-declarations -Wnested-externs -I/Programs/Nessus/include -I/Programs/Nessus/include -O2 -pipe -fno-strict-aliasing -MT xcb_in.lo -MD -MP -MF .deps/xcb_in.Tpo -c xcb_in.c  -fPIC -DPIC -o .libs/xcb_in.o
libtool: compile:  cc -DHAVE_CONFIG_H -I. -Wall -pedantic -Wpointer-arith -Wstrict-prototypes -Wmissing-declarations -Wnested-externs -I/Programs/Nessus/include -I/Programs/Nessus/include -O2 -pipe -fno-strict-aliasing -MT xcb_in.lo -MD -MP -MF .deps/xcb_in.Tpo -c xcb_in.c -o xcb_in.o >/dev/null 2>&1
mv -f .deps/xcb_in.Tpo .deps/xcb_in.Plo
/bin/sh ../libtool --tag=CC   --mode=compile cc -DHAVE_CONFIG_H -I.    -Wall -pedantic -Wpointer-arith 		-Wstrict-prototypes -Wmissing-declarations -Wnested-externs -I/Programs/Nessus/include -I/Programs/Nessus/include -O2 -pipe -fno-strict-aliasing -MT xcb_ext.lo -MD -MP -MF .deps/xcb_ext.Tpo -c -o xcb_ext.lo xcb_ext.c
libtool: compile:  cc -DHAVE_CONFIG_H -I. -Wall -pedantic -Wpointer-arith -Wstrict-prototypes -Wmissing-declarations -Wnested-externs -I/Programs/Nessus/include -I/Programs/Nessus/include -O2 -pipe -fno-strict-aliasing -MT xcb_ext.lo -MD -MP -MF .deps/xcb_ext.Tpo -c xcb_ext.c  -fPIC -DPIC -o .libs/xcb_ext.o
libtool: compile:  cc -DHAVE_CONFIG_H -I. -Wall -pedantic -Wpointer-arith -Wstrict-prototypes -Wmissing-declarations -Wnested-externs -I/Programs/Nessus/include -I/Programs/Nessus/include -O2 -pipe -fno-strict-aliasing -MT xcb_ext.lo -MD -MP -MF .deps/xcb_ext.Tpo -c xcb_ext.c -o xcb_ext.o >/dev/null 2>&1
mv -f .deps/xcb_ext.Tpo .deps/xcb_ext.Plo
/bin/sh ../libtool --tag=CC   --mode=compile cc -DHAVE_CONFIG_H -I.    -Wall -pedantic -Wpointer-arith 		-Wstrict-prototypes -Wmissing-declarations -Wnested-externs -I/Programs/Nessus/include -I/Programs/Nessus/include -O2 -pipe -fno-strict-aliasing -MT xcb_xid.lo -MD -MP -MF .deps/xcb_xid.Tpo -c -o xcb_xid.lo xcb_xid.c
libtool: compile:  cc -DHAVE_CONFIG_H -I. -Wall -pedantic -Wpointer-arith -Wstrict-prototypes -Wmissing-declarations -Wnested-externs -I/Programs/Nessus/include -I/Programs/Nessus/include -O2 -pipe -fno-strict-aliasing -MT xcb_xid.lo -MD -MP -MF .deps/xcb_xid.Tpo -c xcb_xid.c  -fPIC -DPIC -o .libs/xcb_xid.o
libtool: compile:  cc -DHAVE_CONFIG_H -I. -Wall -pedantic -Wpointer-arith -Wstrict-prototypes -Wmissing-declarations -Wnested-externs -I/Programs/Nessus/include -I/Programs/Nessus/include -O2 -pipe -fno-strict-aliasing -MT xcb_xid.lo -MD -MP -MF .deps/xcb_xid.Tpo -c xcb_xid.c -o xcb_xid.o >/dev/null 2>&1
mv -f .deps/xcb_xid.Tpo .deps/xcb_xid.Plo
/bin/sh ../libtool --tag=CC   --mode=compile cc -DHAVE_CONFIG_H -I.    -Wall -pedantic -Wpointer-arith 		-Wstrict-prototypes -Wmissing-declarations -Wnested-externs -I/Programs/Nessus/include -I/Programs/Nessus/include -O2 -pipe -fno-strict-aliasing -MT xcb_list.lo -MD -MP -MF .deps/xcb_list.Tpo -c -o xcb_list.lo xcb_list.c
libtool: compile:  cc -DHAVE_CONFIG_H -I. -Wall -pedantic -Wpointer-arith -Wstrict-prototypes -Wmissing-declarations -Wnested-externs -I/Programs/Nessus/include -I/Programs/Nessus/include -O2 -pipe -fno-strict-aliasing -MT xcb_list.lo -MD -MP -MF .deps/xcb_list.Tpo -c xcb_list.c  -fPIC -DPIC -o .libs/xcb_list.o
libtool: compile:  cc -DHAVE_CONFIG_H -I. -Wall -pedantic -Wpointer-arith -Wstrict-prototypes -Wmissing-declarations -Wnested-externs -I/Programs/Nessus/include -I/Programs/Nessus/include -O2 -pipe -fno-strict-aliasing -MT xcb_list.lo -MD -MP -MF .deps/xcb_list.Tpo -c xcb_list.c -o xcb_list.o >/dev/null 2>&1
mv -f .deps/xcb_list.Tpo .deps/xcb_list.Plo
/bin/sh ../libtool --tag=CC   --mode=compile cc -DHAVE_CONFIG_H -I.    -Wall -pedantic -Wpointer-arith 		-Wstrict-prototypes -Wmissing-declarations -Wnested-externs -I/Programs/Nessus/include -I/Programs/Nessus/include -O2 -pipe -fno-strict-aliasing -MT xcb_util.lo -MD -MP -MF .deps/xcb_util.Tpo -c -o xcb_util.lo xcb_util.c
libtool: compile:  cc -DHAVE_CONFIG_H -I. -Wall -pedantic -Wpointer-arith -Wstrict-prototypes -Wmissing-declarations -Wnested-externs -I/Programs/Nessus/include -I/Programs/Nessus/include -O2 -pipe -fno-strict-aliasing -MT xcb_util.lo -MD -MP -MF .deps/xcb_util.Tpo -c xcb_util.c  -fPIC -DPIC -o .libs/xcb_util.o
libtool: compile:  cc -DHAVE_CONFIG_H -I. -Wall -pedantic -Wpointer-arith -Wstrict-prototypes -Wmissing-declarations -Wnested-externs -I/Programs/Nessus/include -I/Programs/Nessus/include -O2 -pipe -fno-strict-aliasing -MT xcb_util.lo -MD -MP -MF .deps/xcb_util.Tpo -c xcb_util.c -o xcb_util.o >/dev/null 2>&1
mv -f .deps/xcb_util.Tpo .deps/xcb_util.Plo
/bin/sh ../libtool --tag=CC   --mode=compile cc -DHAVE_CONFIG_H -I.    -Wall -pedantic -Wpointer-arith 		-Wstrict-prototypes -Wmissing-declarations -Wnested-externs -I/Programs/Nessus/include -I/Programs/Nessus/include -O2 -pipe -fno-strict-aliasing -MT xcb_auth.lo -MD -MP -MF .deps/xcb_auth.Tpo -c -o xcb_auth.lo xcb_auth.c
libtool: compile:  cc -DHAVE_CONFIG_H -I. -Wall -pedantic -Wpointer-arith -Wstrict-prototypes -Wmissing-declarations -Wnested-externs -I/Programs/Nessus/include -I/Programs/Nessus/include -O2 -pipe -fno-strict-aliasing -MT xcb_auth.lo -MD -MP -MF .deps/xcb_auth.Tpo -c xcb_auth.c  -fPIC -DPIC -o .libs/xcb_auth.o
libtool: compile:  cc -DHAVE_CONFIG_H -I. -Wall -pedantic -Wpointer-arith -Wstrict-prototypes -Wmissing-declarations -Wnested-externs -I/Programs/Nessus/include -I/Programs/Nessus/include -O2 -pipe -fno-strict-aliasing -MT xcb_auth.lo -MD -MP -MF .deps/xcb_auth.Tpo -c xcb_auth.c -o xcb_auth.o >/dev/null 2>&1
mv -f .deps/xcb_auth.Tpo .deps/xcb_auth.Plo
/bin/sh ../libtool --tag=CC   --mode=compile cc -DHAVE_CONFIG_H -I.    -Wall -pedantic -Wpointer-arith 		-Wstrict-prototypes -Wmissing-declarations -Wnested-externs -I/Programs/Nessus/include -I/Programs/Nessus/include -O2 -pipe -fno-strict-aliasing -MT xproto.lo -MD -MP -MF .deps/xproto.Tpo -c -o xproto.lo xproto.c
libtool: compile:  cc -DHAVE_CONFIG_H -I. -Wall -pedantic -Wpointer-arith -Wstrict-prototypes -Wmissing-declarations -Wnested-externs -I/Programs/Nessus/include -I/Programs/Nessus/include -O2 -pipe -fno-strict-aliasing -MT xproto.lo -MD -MP -MF .deps/xproto.Tpo -c xproto.c  -fPIC -DPIC -o .libs/xproto.o
libtool: compile:  cc -DHAVE_CONFIG_H -I. -Wall -pedantic -Wpointer-arith -Wstrict-prototypes -Wmissing-declarations -Wnested-externs -I/Programs/Nessus/include -I/Programs/Nessus/include -O2 -pipe -fno-strict-aliasing -MT xproto.lo -MD -MP -MF .deps/xproto.Tpo -c xproto.c -o xproto.o >/dev/null 2>&1
eval: cannot create /dev/null: Operation not supported
eval: rm: not found
gmake[2]: *** [xproto.lo] Error 1
gmake[2]: Leaving directory `/usr/ports/x11/libxcb/work/libxcb-1.5/src'
gmake[1]: *** [all] Error 2
gmake[1]: Leaving directory `/usr/ports/x11/libxcb/work/libxcb-1.5/src'
gmake: *** [all-recursive] Error 1
*** Error code 1

Stop in /usr/ports/x11/libxcb.
*** Error code 1

Stop in /usr/ports/x11/libX11.
*** Error code 1

Stop in /usr/ports/x11/libXext.
*** Error code 1

Stop in /usr/ports/x11-toolkits/gtk20.
umount: not found
chroot: /makeport.sh: No such file or directory
ERROR: 2.1 Build failed of security/nessus/!!!


More information about the Pbibuild mailing list