[Pbibuild] PBI-7 Autobuild (amd64): graphics/gimp/

PC-BSD Build7 (amd64) root at build7x64.pcbsd.org
Sun Nov 29 21:35:50 PST 2009


PBI Autobuild results for module graphics/gimp/:
Status: Failed

View Folder:
ftp://ftp.pcbsd.org/pub/pbioutgoing/x64/7/outgoing/graphics/gimp//

File listing:
-rwxr-xr-x  1 root  wheel  39190793 Sep 28 15:36 Gimp2.6.6-PV0.pbi
-rw-r--r--  1 root  wheel        59 Nov 30 00:35 Gimp2.6.6-PV0.pbi.md5
-rw-r--r--  1 root  wheel   1290897 Nov 30 00:35 build.log.bz2
-rw-r--r--  1 root  wheel         0 Nov 29 00:32 build.time
-rw-r--r--  1 root  wheel         7 Nov 29 21:28 dirstatus
-rw-r--r--  1 root  wheel        16 Sep 28 15:36 mdate

PBI MD5:
MD5 (Gimp2.6.6-PV0.pbi) = e31ededeabf0727ed27f0bdbe5676b71


Last 50 lines of build.log
---------------------------------------------------
genppd.c:1346: error: for each function it appears in.)
genppd.c:1346: error: 'CUPS_ORDER_CHUNKED' undeclared (first use in this function)
genppd.c:1353: error: 'CUPS_CSPACE_K' undeclared (first use in this function)
genppd.c:1363: error: 'CUPS_CSPACE_RGB' undeclared (first use in this function)
genppd.c:1370: error: 'CUPS_CSPACE_CMY' undeclared (first use in this function)
genppd.c:1377: error: 'CUPS_CSPACE_CMYK' undeclared (first use in this function)
genppd.c:1384: error: 'CUPS_CSPACE_KCMY' undeclared (first use in this function)
gmake: *** [gutenprint_5_1-genppd.o] Error 1
*** Error code 1

Stop in /usr/ports/print/gutenprint-cups.
*** Error code 1

Stop in /usr/ports/print/gutenprint.
*** Error code 1

Stop in /usr/ports/graphics/gimp.
===>  Installing for gimp-2.6.7,2
===>   gimp-2.6.7,2 depends on executable: gimp-2.6 - found
===>   gimp-2.6.7,2 depends on file: /Programs/Gimp2.6.7/libexec/gimp/2.2/plug-ins/gutenprint - found
===>   gimp-2.6.7,2 depends on package: gutenprint>0 - not found
===>    Verifying install for gutenprint>0 in /usr/ports/print/gutenprint
===>  Installing for gutenprint-5.1.7_1
===>   gutenprint-5.1.7_1 depends on package: gutenprint-base>0 - found
===>   gutenprint-5.1.7_1 depends on package: gutenprint-cups>0 - not found
===>    Verifying install for gutenprint-cups>0 in /usr/ports/print/gutenprint-cups
===>  Building for gutenprint-cups-5.1.7_4
cc -DHAVE_CONFIG_H -I. -I../..  -I../../include -I../../include  -I/Programs/Gimp2.6.7/include -Wall -Wcast-align -Wstrict-prototypes -Wmissing-prototypes -Wmissing-declarations -Wnested-externs -Wwrite-strings -Werror-implicit-function-declaration -Winline -Wformat=2 -finline-limit=131072 -I/Programs/Gimp2.6.7/include -I/Programs/Gimp2.6.7/include -DCUPS_DRIVER_INTERFACE -DALL_LINGUAS='"cs da de el en_GB es fr hu ja nb nl pl pt sk sv zh_TW"'  -DCUPS_TRANSLATED_PPDS -Disfinite=finite -O2 -fno-strict-aliasing -pipe -O6 -MT gutenprint_5_1-genppd.o -MD -MP -MF .deps/gutenprint_5_1-genppd.Tpo -c -o gutenprint_5_1-genppd.o `test -f 'genppd.c' || echo './'`genppd.c
genppd.c:81:25: error: cups/raster.h: No such file or directory
genppd.c: In function 'write_ppd':
genppd.c:1346: error: 'CUPS_CSPACE_W' undeclared (first use in this function)
genppd.c:1346: error: (Each undeclared identifier is reported only once
genppd.c:1346: error: for each function it appears in.)
genppd.c:1346: error: 'CUPS_ORDER_CHUNKED' undeclared (first use in this function)
genppd.c:1353: error: 'CUPS_CSPACE_K' undeclared (first use in this function)
genppd.c:1363: error: 'CUPS_CSPACE_RGB' undeclared (first use in this function)
genppd.c:1370: error: 'CUPS_CSPACE_CMY' undeclared (first use in this function)
genppd.c:1377: error: 'CUPS_CSPACE_CMYK' undeclared (first use in this function)
genppd.c:1384: error: 'CUPS_CSPACE_KCMY' undeclared (first use in this function)
gmake: *** [gutenprint_5_1-genppd.o] Error 1
*** Error code 1

Stop in /usr/ports/print/gutenprint-cups.
*** Error code 1

Stop in /usr/ports/print/gutenprint.
*** Error code 1

Stop in /usr/ports/graphics/gimp.
ERROR: 2.1 Build failed of graphics/gimp/!!!


More information about the Pbibuild mailing list