[Pbibuild] PBI Autobuild: kdenlive

PCBSD Build Server root at pbibuild.pcbsd.org
Mon Mar 23 01:11:39 PST 2009


PBI Autobuild results for module kdenlive:
Status: Failed

View Folder:
ftp://ftp.pcbsd.org/pub/pbioutgoing/i386/outgoing/kdenlive/

File listing:
-rw-r--r--  1 root  wheel  589472 Mar 23 05:11 build.log.bz2
-rw-r--r--  1 root  wheel       0 Mar 22 11:09 build.time
-rw-r--r--  1 root  wheel       7 Mar 23 02:44 dirstatus

PBI MD5:



Last 30 lines of build.log
---------------------------------------------------
MltMiracle.cpp: In static member function `static void Mlt::Miracle::log_level(int)':
MltMiracle.cpp:150: error: `log_stderr' was not declared in this scope
MltMiracle.cpp:150: error: `miracle_log_init' was not declared in this scope
MltMiracle.cpp:150: warning: unused variable 'log_stderr'
MltMiracle.cpp:150: warning: unused variable 'miracle_log_init'
MltMiracle.cpp: In member function `Mlt::Properties* Mlt::Miracle::unit(int)':
MltMiracle.cpp:155: error: `server' was not declared in this scope
MltMiracle.cpp:155: error: `miracle_server_fetch_unit' was not declared in this scope
MltMiracle.cpp:155: warning: unused variable 'server'
MltMiracle.cpp:155: warning: unused variable 'miracle_server_fetch_unit'
gmake[1]: *** [MltMiracle.o] Error 1
gmake[1]: Leaving directory `/usr/ports/multimedia/mlt++/work/mlt++-0.3.2/src'
gmake: *** [all] Error 2
===>  Installing for mlt++-0.3.2
===>   Generating temporary packing list
gmake DESTDIR= -C src install 
gmake[1]: Entering directory `/usr/ports/multimedia/mlt++/work/mlt++-0.3.2/src'
install -d "/usr/local/lib"
install -m 755 libmlt++.so.0.3.2 /usr/local/lib
install: libmlt++.so.0.3.2: No such file or directory
gmake[1]: *** [install] Error 71
gmake[1]: Leaving directory `/usr/ports/multimedia/mlt++/work/mlt++-0.3.2/src'
gmake: *** [install] Error 2
*** Error code 2

Stop in /usr/ports/multimedia/mlt++.
*** Error code 1

Stop in /usr/ports/multimedia/kdenlive.
ERROR: 2.1 Build failed of kdenlive!!!


More information about the Pbibuild mailing list