[Pbibuild] PBI Autobuild: tellico

PCBSD Build Server root at pbibuild.pcbsd.org
Sun Jan 11 17:54:31 PST 2009


PBI Autobuild results for module tellico:
Status: Failed

View Folder:
ftp://ftp.pcbsd.org/pub/pbioutgoing/i386/outgoing/tellico/

File listing:
-rwxr-xr-x  1 root  wheel  16834250 Jun 14  2008 Tellico1.3.1_1-PV0.pbi
-rw-r--r--  1 root  wheel        64 Jan 11 20:54 Tellico1.3.1_1-PV0.pbi.md5
-rwxr-xr-x  1 root  wheel  16912650 Jul  1  2008 Tellico1.3.2.1-PV0.pbi
-rw-r--r--  1 root  wheel        64 Jan 11 20:54 Tellico1.3.2.1-PV0.pbi.md5
-rw-r--r--  1 root  wheel    455111 Jan 11 20:54 build.log.bz2
-rw-r--r--  1 root  wheel         0 Jul  1  2008 build.time
-rw-r--r--  1 root  wheel         7 Jan 11 19:01 dirstatus
-rw-r--r--  1 root  wheel      1256 Jul  8  2008 index.php

PBI MD5:
MD5 (Tellico1.3.1_1-PV0.pbi) = 05b3df3b69ad261abd96515c99e34f95
MD5 (Tellico1.3.2.1-PV0.pbi) = 88d4bcd9082e9f26574c0d66743addaf


Last 30 lines of build.log
---------------------------------------------------
gmake[3]: Nothing to be done for `all'.
gmake[3]: Leaving directory `/usr/ports/audio/arts/work/arts-1.5.10/flow/gsl'
Making all in gslpp
gmake[3]: Entering directory `/usr/ports/audio/arts/work/arts-1.5.10/flow/gslpp'
gmake[3]: Nothing to be done for `all'.
gmake[3]: Leaving directory `/usr/ports/audio/arts/work/arts-1.5.10/flow/gslpp'
gmake[3]: Entering directory `/usr/ports/audio/arts/work/arts-1.5.10/flow'
gmake[3]: Nothing to be done for `all-am'.
gmake[3]: Leaving directory `/usr/ports/audio/arts/work/arts-1.5.10/flow'
gmake[2]: Leaving directory `/usr/ports/audio/arts/work/arts-1.5.10/flow'
Making all in mcop_mt
gmake[2]: Entering directory `/usr/ports/audio/arts/work/arts-1.5.10/mcop_mt'
/bin/sh /Programs/Tellico1.3.4/bin/libtool --silent --tag=CXX   --mode=compile c++ -DHAVE_CONFIG_H -I. -I.. -I../mcop -I../artsc -I../mcop -I../mcop -I../flow -I../flow -I/Programs/Tellico1.3.4/include -I/Programs/Tellico1.3.4/include  -I/Programs/Tellico1.3.4/include -I../libltdl  -D_THREAD_SAFE -pthread -DQT_THREAD_SUPPORT  -L/Programs/Tellico1.3.4/lib -I/Programs/Tellico1.3.4/include -I/Programs/Tellico1.3.4/include  -I/Programs/Tellico1.3.4/include -D_GETOPT_H -D_THREAD_SAFE  -D_REENTRANT -I/Programs/Tellico1.3.4/include/glib-2.0 -I/Programs/Tellico1.3.4/lib/glib-2.0/include    -Wno-long-long -Wundef -Wall -W -Wpointer-arith -DNDEBUG -DNO_DEBUG -O2 -fno-strict-aliasing -pipe -DHAVE_VASPRINTF -Wno-non-virtual-dtor -fno-exceptions -fno-check-new -fno-common  -ftemplate-depth-99  -MT threads_posix.lo -MD -MP -MF .deps/threads_posix.Tpo -c -o threads_posix.lo threads_posix.cc
threads_posix.cc: In function `void Arts::PosixThreads::pth_rec_cond_wait_timed(Arts::PosixThreads::GslCond*, Arts::PosixThreads::GslMutex*, Arts::PosixThreads::gulong, Arts::PosixThreads::gulong)':
threads_posix.cc:361: error: aggregate `Arts::PosixThreads::timespec abstime' has incomplete type and cannot be defined
gmake[2]: *** [threads_posix.lo] Error 1
gmake[2]: Leaving directory `/usr/ports/audio/arts/work/arts-1.5.10/mcop_mt'
gmake[1]: *** [all-recursive] Error 1
gmake[1]: Leaving directory `/usr/ports/audio/arts/work/arts-1.5.10'
gmake: *** [all] Error 2
*** Error code 2

Stop in /usr/ports/audio/arts.
*** Error code 1

Stop in /usr/ports/x11/kdelibs3.
*** Error code 1

Stop in /usr/ports/misc/tellico.
ERROR: 2.1 Build failed of tellico!!!


More information about the Pbibuild mailing list