[Pbibuild] PBI Autobuild: smb4k

PCBSD Build Server root at pbibuild.pcbsd.org
Sun Jan 11 14:29:50 PST 2009


PBI Autobuild results for module smb4k:
Status: Failed

View Folder:
ftp://ftp.pcbsd.org/pub/pbioutgoing/i386/outgoing/smb4k/

File listing:
-rwxr-xr-x  1 root  wheel  10819180 Nov 22 08:17 Smb4K0.9.9-PV0.pbi
-rw-r--r--  1 root  wheel        60 Jan 11 17:29 Smb4K0.9.9-PV0.pbi.md5
-rw-r--r--  1 root  wheel    413825 Jan 11 17:29 build.log.bz2
-rw-r--r--  1 root  wheel         0 Nov 22 08:17 build.time
-rw-r--r--  1 root  wheel         7 Jan 11 15:37 dirstatus
-rw-r--r--  1 root  wheel      1256 Jul  8  2008 index.php

PBI MD5:
MD5 (Smb4K0.9.9-PV0.pbi) = 44ea4823051e242579ddaedcbcba4020


Last 30 lines of build.log
---------------------------------------------------
gmake[3]: Entering directory `/usr/ports/audio/arts/work/arts-1.5.10/flow/gslpp'
gmake[3]: Nothing to be done for `all'.
gmake[3]: Leaving directory `/usr/ports/audio/arts/work/arts-1.5.10/flow/gslpp'
gmake[3]: Entering directory `/usr/ports/audio/arts/work/arts-1.5.10/flow'
gmake[3]: Nothing to be done for `all-am'.
gmake[3]: Leaving directory `/usr/ports/audio/arts/work/arts-1.5.10/flow'
gmake[2]: Leaving directory `/usr/ports/audio/arts/work/arts-1.5.10/flow'
Making all in mcop_mt
gmake[2]: Entering directory `/usr/ports/audio/arts/work/arts-1.5.10/mcop_mt'
/bin/sh /Programs/Smb4K0.9.9_1/bin/libtool --silent --tag=CXX   --mode=compile c++ -DHAVE_CONFIG_H -I. -I.. -I../mcop -I../artsc -I../mcop -I../mcop -I../flow -I../flow -I/Programs/Smb4K0.9.9_1/include -I/Programs/Smb4K0.9.9_1/include  -I/Programs/Smb4K0.9.9_1/include -I../libltdl  -D_THREAD_SAFE -pthread -DQT_THREAD_SUPPORT  -L/Programs/Smb4K0.9.9_1/lib -I/Programs/Smb4K0.9.9_1/include -I/Programs/Smb4K0.9.9_1/include  -I/Programs/Smb4K0.9.9_1/include -D_GETOPT_H -D_THREAD_SAFE  -D_REENTRANT -I/Programs/Smb4K0.9.9_1/include/glib-2.0 -I/Programs/Smb4K0.9.9_1/lib/glib-2.0/include    -Wno-long-long -Wundef -Wall -W -Wpointer-arith -DNDEBUG -DNO_DEBUG -O2 -fno-strict-aliasing -pipe -DHAVE_VASPRINTF -Wno-non-virtual-dtor -fno-exceptions -fno-check-new -fno-common  -ftemplate-depth-99  -MT threads_posix.lo -MD -MP -MF .deps/threads_posix.Tpo -c -o threads_posix.lo threads_posix.cc
threads_posix.cc: In function `void Arts::PosixThreads::pth_rec_cond_wait_timed(Arts::PosixThreads::GslCond*, Arts::PosixThreads::GslMutex*, Arts::PosixThreads::gulong, Arts::PosixThreads::gulong)':
threads_posix.cc:361: error: aggregate `Arts::PosixThreads::timespec abstime' has incomplete type and cannot be defined
gmake[2]: *** [threads_posix.lo] Error 1
gmake[2]: Leaving directory `/usr/ports/audio/arts/work/arts-1.5.10/mcop_mt'
gmake[1]: *** [all-recursive] Error 1
gmake[1]: Leaving directory `/usr/ports/audio/arts/work/arts-1.5.10'
gmake: *** [all] Error 2
*** Error code 2

Stop in /usr/ports/audio/arts.
*** Error code 1

Stop in /usr/ports/x11/kdelibs3.
*** Error code 1

Stop in /usr/ports/x11/kdebase3.
*** Error code 1

Stop in /usr/ports/net/smb4k.
ERROR: 2.1 Build failed of smb4k!!!


More information about the Pbibuild mailing list