[Pbibuild] PBI-7 Autobuild (amd64): yakuake

PC-BSD Build7 (amd64) root at pbibuild64.pcbsd.org
Sat Jan 10 17:03:07 PST 2009


PBI Autobuild results for module yakuake:
Status: Failed

View Folder:
ftp://ftp.pcbsd.org/pub/pbioutgoing/x64/7/outgoing/yakuake/

File listing:
-rwxr-xr-x  1 root  wheel  10294224 Oct  8 20:06 Yakuake2.8.1_1-PV0.pbi
-rw-r--r--  1 root  wheel        64 Jan 10 20:03 Yakuake2.8.1_1-PV0.pbi.md5
-rw-r--r--  1 root  wheel    433445 Jan 10 20:02 build.log.bz2
-rw-r--r--  1 root  wheel         0 Oct  8 20:06 build.time
-rw-r--r--  1 root  wheel         7 Jan 10 18:42 dirstatus

PBI MD5:
MD5 (Yakuake2.8.1_1-PV0.pbi) = 1cb8aaf37a9c34463a2066b392669469


Last 50 lines of build.log
---------------------------------------------------
gmake[2]: Entering directory `/usr/ports/audio/arts/work/arts-1.5.10/mcop'
gmake  all-am
gmake[3]: Entering directory `/usr/ports/audio/arts/work/arts-1.5.10/mcop'
gmake[3]: Leaving directory `/usr/ports/audio/arts/work/arts-1.5.10/mcop'
gmake[2]: Leaving directory `/usr/ports/audio/arts/work/arts-1.5.10/mcop'
Making all in mcopidl
gmake[2]: Entering directory `/usr/ports/audio/arts/work/arts-1.5.10/mcopidl'
gmake[2]: Nothing to be done for `all'.
gmake[2]: Leaving directory `/usr/ports/audio/arts/work/arts-1.5.10/mcopidl'
Making all in flow
gmake[2]: Entering directory `/usr/ports/audio/arts/work/arts-1.5.10/flow'
Making all in mcopclass
gmake[3]: Entering directory `/usr/ports/audio/arts/work/arts-1.5.10/flow/mcopclass'
gmake[3]: Nothing to be done for `all'.
gmake[3]: Leaving directory `/usr/ports/audio/arts/work/arts-1.5.10/flow/mcopclass'
Making all in gsl
gmake[3]: Entering directory `/usr/ports/audio/arts/work/arts-1.5.10/flow/gsl'
gmake[3]: Nothing to be done for `all'.
gmake[3]: Leaving directory `/usr/ports/audio/arts/work/arts-1.5.10/flow/gsl'
Making all in gslpp
gmake[3]: Entering directory `/usr/ports/audio/arts/work/arts-1.5.10/flow/gslpp'
gmake[3]: Nothing to be done for `all'.
gmake[3]: Leaving directory `/usr/ports/audio/arts/work/arts-1.5.10/flow/gslpp'
gmake[3]: Entering directory `/usr/ports/audio/arts/work/arts-1.5.10/flow'
gmake[3]: Nothing to be done for `all-am'.
gmake[3]: Leaving directory `/usr/ports/audio/arts/work/arts-1.5.10/flow'
gmake[2]: Leaving directory `/usr/ports/audio/arts/work/arts-1.5.10/flow'
Making all in mcop_mt
gmake[2]: Entering directory `/usr/ports/audio/arts/work/arts-1.5.10/mcop_mt'
/bin/sh /Programs/Yakuake2.8.1_2/bin/libtool --silent --tag=CXX   --mode=compile c++ -DHAVE_CONFIG_H -I. -I.. -I../mcop -I../artsc -I../mcop -I../mcop -I../flow -I../flow -I/Programs/Yakuake2.8.1_2/include -I/Programs/Yakuake2.8.1_2/include  -I/Programs/Yakuake2.8.1_2/include -I../libltdl  -D_THREAD_SAFE -pthread -DQT_THREAD_SUPPORT  -L/Programs/Yakuake2.8.1_2/lib -I/Programs/Yakuake2.8.1_2/include -I/Programs/Yakuake2.8.1_2/include  -I/Programs/Yakuake2.8.1_2/include -D_GETOPT_H -D_THREAD_SAFE  -D_REENTRANT -I/Programs/Yakuake2.8.1_2/include/glib-2.0 -I/Programs/Yakuake2.8.1_2/lib/glib-2.0/include    -Wno-long-long -Wundef -Wall -W -Wpointer-arith -DNDEBUG -DNO_DEBUG -O2 -fno-strict-aliasing -pipe -DHAVE_VASPRINTF -Wno-non-virtual-dtor -fno-exceptions -fno-check-new -fno-common  -ftemplate-depth-99  -MT threads_posix.lo -MD -MP -MF .deps/threads_posix.Tpo -c -o threads_posix.lo threads_posix.cc
threads_posix.cc: In function 'void Arts::PosixThreads::pth_rec_cond_wait_timed(Arts::PosixThreads::GslCond*, Arts::PosixThreads::GslMutex*, Arts::PosixThreads::gulong, Arts::PosixThreads::gulong)':
threads_posix.cc:361: error: aggregate 'Arts::PosixThreads::timespec abstime' has incomplete type and cannot be defined
gmake[2]: *** [threads_posix.lo] Error 1
gmake[2]: Leaving directory `/usr/ports/audio/arts/work/arts-1.5.10/mcop_mt'
gmake[1]: *** [all-recursive] Error 1
gmake[1]: Leaving directory `/usr/ports/audio/arts/work/arts-1.5.10'
gmake: *** [all] Error 2
*** Error code 2

Stop in /usr/ports/audio/arts.
*** Error code 1

Stop in /usr/ports/x11/kdelibs3.
*** Error code 1

Stop in /usr/ports/x11/kdebase3.
*** Error code 1

Stop in /usr/ports/x11/yakuake.
ERROR: 2.1 Build failed of yakuake!!!


More information about the Pbibuild mailing list