[Pbibuild] PBI-7 Autobuild (i386): amarok

PCBSD Build Server root at pbibuild.pcbsd.org
Wed Feb 25 03:28:44 PST 2009


PBI Autobuild results for module amarok:
Status: Failed

View Folder:
ftp://ftp.pcbsd.org/pub/pbioutgoing/i386/7/outgoing/amarok/

File listing:
-rwxr-xr-x  1 root  wheel  39179922 Feb  9 14:19 Amarok1.4.10_2-PV0.pbi
-rw-r--r--  1 root  wheel        64 Feb 25 06:28 Amarok1.4.10_2-PV0.pbi.md5
-rw-r--r--  1 root  wheel    782411 Feb 25 06:28 build.log.bz2
-rw-r--r--  1 root  wheel         0 Feb  9 14:19 build.time
-rw-r--r--  1 root  wheel         7 Feb 24 11:04 dirstatus
-rw-r--r--  1 root  wheel        16 Feb  9 14:19 mdate

PBI MD5:
MD5 (Amarok1.4.10_2-PV0.pbi) = 1ee354f5e6d6e4b89372ecb5acf4d816


Last 50 lines of build.log
---------------------------------------------------
gmake[3]: Entering directory `/usr/ports/sysutils/hal/work/hal-0.5.11/hald'
Making all in dummy
gmake[4]: Entering directory `/usr/ports/sysutils/hal/work/hal-0.5.11/hald/dummy'
gmake[4]: Nothing to be done for `all'.
gmake[4]: Leaving directory `/usr/ports/sysutils/hal/work/hal-0.5.11/hald/dummy'
Making all in freebsd
gmake[4]: Entering directory `/usr/ports/sysutils/hal/work/hal-0.5.11/hald/freebsd'
Making all in libprobe
gmake[5]: Entering directory `/usr/ports/sysutils/hal/work/hal-0.5.11/hald/freebsd/libprobe'
gmake[5]: Nothing to be done for `all'.
gmake[5]: Leaving directory `/usr/ports/sysutils/hal/work/hal-0.5.11/hald/freebsd/libprobe'
Making all in probing
gmake[5]: Entering directory `/usr/ports/sysutils/hal/work/hal-0.5.11/hald/freebsd/probing'
gmake[5]: Nothing to be done for `all'.
gmake[5]: Leaving directory `/usr/ports/sysutils/hal/work/hal-0.5.11/hald/freebsd/probing'
Making all in addons
gmake[5]: Entering directory `/usr/ports/sysutils/hal/work/hal-0.5.11/hald/freebsd/addons'
gmake[5]: Nothing to be done for `all'.
gmake[5]: Leaving directory `/usr/ports/sysutils/hal/work/hal-0.5.11/hald/freebsd/addons'
Making all in .
gmake[5]: Entering directory `/usr/ports/sysutils/hal/work/hal-0.5.11/hald/freebsd'
/bin/sh /usr/ports/sysutils/hal/work/gnome-libtool --tag=CC   --mode=compile cc -DHAVE_CONFIG_H -I. -I../..  -DPACKAGE_SYSCONF_DIR=\""/Programs/Amarok1.4.10_2/etc"\" -DPACKAGE_DATA_DIR=\""/Programs/Amarok1.4.10_2/share"\" -DPACKAGE_BIN_DIR=\""/Programs/Amarok1.4.10_2/bin"\" -DPACKAGE_LOCALE_DIR=\""/Programs/Amarok1.4.10_2/share/locale"\" -DPACKAGE_LOCALSTATEDIR=\""/var"\" -I../.. -I.. -I/Programs/Amarok1.4.10_2/include/glib-2.0 -I/Programs/Amarok1.4.10_2/lib/glib-2.0/include -I/Programs/Amarok1.4.10_2/include/dbus-1.0 -I/Programs/Amarok1.4.10_2/include/dbus-1.0/include   -I/Programs/Amarok1.4.10_2/include/dbus-1.0 -I/Programs/Amarok1.4.10_2/include/dbus-1.0/include   -I/Programs/Amarok1.4.10_2/include/PolicyKit   -I/Programs/Amarok1.4.10_2/include -DHAVE_CK_0_3  -O2 -fno-strict-aliasing -pipe -Wall -Wchar-subscripts -Wmissing-declarations -Wnested-externs -Wpointer-arith -Wcast-align -Wsign-compare -MT hf-storage.lo -MD -MP -MF .deps/hf-storage.Tpo -c -o hf-storage.lo hf-stor
 age.c
 cc -DHAVE_CONFIG_H -I. -I../.. -DPACKAGE_SYSCONF_DIR=\"/Programs/Amarok1.4.10_2/etc\" -DPACKAGE_DATA_DIR=\"/Programs/Amarok1.4.10_2/share\" -DPACKAGE_BIN_DIR=\"/Programs/Amarok1.4.10_2/bin\" -DPACKAGE_LOCALE_DIR=\"/Programs/Amarok1.4.10_2/share/locale\" -DPACKAGE_LOCALSTATEDIR=\"/var\" -I../.. -I.. -I/Programs/Amarok1.4.10_2/include/glib-2.0 -I/Programs/Amarok1.4.10_2/lib/glib-2.0/include -I/Programs/Amarok1.4.10_2/include/dbus-1.0 -I/Programs/Amarok1.4.10_2/include/dbus-1.0/include -I/Programs/Amarok1.4.10_2/include/dbus-1.0 -I/Programs/Amarok1.4.10_2/include/dbus-1.0/include -I/Programs/Amarok1.4.10_2/include/PolicyKit -I/Programs/Amarok1.4.10_2/include -DHAVE_CK_0_3 -O2 -fno-strict-aliasing -pipe -Wall -Wchar-subscripts -Wmissing-declarations -Wnested-externs -Wpointer-arith -Wcast-align -Wsign-compare -MT hf-storage.lo -MD -MP -MF .deps/hf-storage.Tpo -c hf-storage.c  -fPIC -DPIC -o .libs/hf-storage.o
hf-storage.c: In function 'hf_storage_conftxt_timeout_cb':
hf-storage.c:580: warning: implicit declaration of function 'hf_storage_devd_notify'
hf-storage.c:580: warning: nested extern declaration of 'hf_storage_devd_notify'
hf-storage.c: At top level:
hf-storage.c:591: error: static declaration of 'hf_storage_devd_notify' follows non-static declaration
hf-storage.c:580: error: previous implicit declaration of 'hf_storage_devd_notify' was here
gmake[5]: *** [hf-storage.lo] Error 1
gmake[5]: Leaving directory `/usr/ports/sysutils/hal/work/hal-0.5.11/hald/freebsd'
gmake[4]: *** [all-recursive] Error 1
gmake[4]: Leaving directory `/usr/ports/sysutils/hal/work/hal-0.5.11/hald/freebsd'
gmake[3]: *** [all-recursive] Error 1
gmake[3]: Leaving directory `/usr/ports/sysutils/hal/work/hal-0.5.11/hald'
gmake[2]: *** [all] Error 2
gmake[2]: Leaving directory `/usr/ports/sysutils/hal/work/hal-0.5.11/hald'
gmake[1]: *** [all-recursive] Error 1
gmake[1]: Leaving directory `/usr/ports/sysutils/hal/work/hal-0.5.11'
gmake: *** [all] Error 2
*** Error code 2

Stop in /usr/ports/sysutils/hal.
*** Error code 1

Stop in /usr/ports/x11/kdebase3.
*** Error code 1

Stop in /usr/ports/audio/amarok.
ERROR: 2.1 Build failed of amarok!!!


More information about the Pbibuild mailing list