[Pbibuild] PBI Autobuild: fldigi

PCBSD Build Server root at pbibuild.pcbsd.org
Mon Apr 20 04:21:35 PDT 2009


PBI Autobuild results for module fldigi:
Status: Failed

View Folder:
ftp://ftp.pcbsd.org/pub/pbioutgoing/i386/outgoing/fldigi/

File listing:
-rwxr-xr-x  1 root  wheel  10382474 Jan 25 17:14 FLDIGI3.10-PV0.pbi
-rw-r--r--  1 root  wheel        60 Apr 20 07:21 FLDIGI3.10-PV0.pbi.md5
-rw-r--r--  1 root  wheel    823845 Apr 20 07:21 build.log.bz2
-rw-r--r--  1 root  wheel         0 Jan 25 17:14 build.time
-rw-r--r--  1 root  wheel      1256 Jul  8  2008 index.php
-rw-r--r--  1 root  wheel        16 Jan 25 17:14 mdate

PBI MD5:
MD5 (FLDIGI3.10-PV0.pbi) = 1fd855c0b8bbbeb2f1d901c4d5a08e1f


Last 30 lines of build.log
---------------------------------------------------
gmake[1]: Leaving directory `/usr/ports/comms/fldigi/work/fldigi-3.11/src'
gmake: *** [all-recursive] Error 1
*** Error code 1

Stop in /usr/ports/comms/fldigi.
===>  Building for fldigi-3.11_1
Making all in po
gmake[1]: Entering directory `/usr/ports/comms/fldigi/work/fldigi-3.11/po'
gmake[1]: Leaving directory `/usr/ports/comms/fldigi/work/fldigi-3.11/po'
Making all in doc
gmake[1]: Entering directory `/usr/ports/comms/fldigi/work/fldigi-3.11/doc'
gmake[1]: Nothing to be done for `all'.
gmake[1]: Leaving directory `/usr/ports/comms/fldigi/work/fldigi-3.11/doc'
Making all in src
gmake[1]: Entering directory `/usr/ports/comms/fldigi/work/fldigi-3.11/src'
gmake  all-am
gmake[2]: Entering directory `/usr/ports/comms/fldigi/work/fldigi-3.11/src'
g++42 -DHAVE_CONFIG_H -I.  -DLOCALEDIR=\"/Programs/FLDIGI3.11_1/share/locale\" -I. -I./include -I./irrxml -I./fileselector   -DNDEBUG  -pthread -I/Programs/FLDIGI3.11_1/include/portaudio2   -I/Programs/FLDIGI3.11_1/include -I/Programs/FLDIGI3.11_1/include/freetype2 -I/Programs/FLDIGI3.11_1/include -O2 -fno-strict-aliasing -pipe -I/Programs/FLDIGI3.11_1/include -D_THREAD_SAFE -D_REENTRANT -I/Programs/FLDIGI3.11_1/include -I/Programs/FLDIGI3.11_1/include   -D_REENTRANT -I/Programs/FLDIGI3.11_1/include   -I/Programs/FLDIGI3.11_1/include -pipe -Wall -fexceptions -O2 -ffast-math -finline-functions -fomit-frame-pointer  -O2 -fno-strict-aliasing -pipe -MT fl_digi.o -MD -MP -MF .deps/fl_digi.Tpo -c -o fl_digi.o `test -f 'dialogs/fl_digi.cxx' || echo './'`dialogs/fl_digi.cxx
dialogs/fl_digi.cxx: In function 'void ztimer(void*)':
dialogs/fl_digi.cxx:1313: error: invalid conversion from 'long int*' to 'const time_t*'
dialogs/fl_digi.cxx:1313: error:   initializing argument 1 of 'tm* gmtime_r(const time_t*, tm*)'
gmake[2]: *** [fl_digi.o] Error 1
gmake[2]: Leaving directory `/usr/ports/comms/fldigi/work/fldigi-3.11/src'
gmake[1]: *** [all] Error 2
gmake[1]: Leaving directory `/usr/ports/comms/fldigi/work/fldigi-3.11/src'
gmake: *** [all-recursive] Error 1
*** Error code 1

Stop in /usr/ports/comms/fldigi.
ERROR: 2.1 Build failed of fldigi!!!


More information about the Pbibuild mailing list