[Pbibuild] PBI Autobuild64: abiword

PCBSD Build x64 root at pbibuild.pcbsd.org
Sat May 24 04:38:11 PDT 2008


PBI Autobuild64 results for module abiword:
Status: Failed

View Folder:
ftp://ftp.pcbsd.org/pub/pbioutgoing/x64/outgoing/abiword/

File listing:
-rw-r--r--  1 root  wheel         8 Feb  1 08:47 AbiWord2.4.6-PV3.pbi.lnk
-rwxr-xr-x  1 root  wheel  11673346 Apr 25 04:29 AbiWord2.6.2-PV0.pbi
-rw-r--r--  1 root  wheel        62 May 24 07:38 AbiWord2.6.2-PV0.pbi.md5
-rw-r--r--  1 root  wheel   8162296 May 24 07:38 build.log
-rw-r--r--  1 root  wheel         0 May 23 19:55 build.time
-rw-r--r--  1 root  wheel         7 May 24 00:36 dirstatus
-rw-r--r--  1 root  wheel      1255 May 24 00:36 index.php

PBI MD5:
MD5 (AbiWord2.6.2-PV0.pbi) = a105b1c366d0fbd4a171a9089f70e1bd


Last 30 lines of build.log
---------------------------------------------------
probe-hiddev.c:104: error: `HUG_GAME_PAD' undeclared (first use in this function)
probe-hiddev.c:104: error: case label does not reduce to an integer constant
probe-hiddev.c:108: error: `HUG_KEYBOARD' undeclared (first use in this function)
probe-hiddev.c:108: error: case label does not reduce to an integer constant
probe-hiddev.c:112: error: `HUG_KEYPAD' undeclared (first use in this function)
probe-hiddev.c:112: error: case label does not reduce to an integer constant
gmake[5]: *** [probe-hiddev.o] Error 1
gmake[5]: Leaving directory `/usr/ports/sysutils/hal/work/hal-0.5.11/hald/freebsd/probing'
gmake[4]: *** [all-recursive] Error 1
gmake[4]: Leaving directory `/usr/ports/sysutils/hal/work/hal-0.5.11/hald/freebsd'
gmake[3]: *** [all-recursive] Error 1
gmake[3]: Leaving directory `/usr/ports/sysutils/hal/work/hal-0.5.11/hald'
gmake[2]: *** [all] Error 2
gmake[2]: Leaving directory `/usr/ports/sysutils/hal/work/hal-0.5.11/hald'
gmake[1]: *** [all-recursive] Error 1
gmake[1]: Leaving directory `/usr/ports/sysutils/hal/work/hal-0.5.11'
gmake: *** [all] Error 2
*** Error code 2

Stop in /usr/ports/sysutils/hal.
*** Error code 1

Stop in /usr/ports/devel/gnome-vfs.
*** Error code 1

Stop in /usr/ports/devel/goffice04.
*** Error code 1

Stop in /usr/ports/editors/abiword.
ERROR: 2.1 Build failed of abiword!!!


More information about the Pbibuild mailing list