[Pbibuild] PBI Autobuild: zsh

PCBSD Build Server root at pbibuild.pcbsd.org
Fri Jun 13 02:25:17 PDT 2008


PBI Autobuild results for module zsh:
Status: Failed

View Folder:
ftp://ftp.pcbsd.org/pub/pbioutgoing/i386/outgoing/zsh/

File listing:
-rwxr-xr-x  1 root  wheel  4345718 May  7 13:02 Zsh4.3.6-PV0.pbi
-rw-r--r--  1 root  wheel       58 Jun 13 05:25 Zsh4.3.6-PV0.pbi.md5
-rwxr-xr-x  1 root  wheel  4345661 May 24 02:25 Zsh4.3.6_1-PV0.pbi
-rw-r--r--  1 root  wheel       60 Jun 13 05:25 Zsh4.3.6_1-PV0.pbi.md5
-rw-r--r--  1 root  wheel  1137861 Jun 13 05:25 build.log
-rw-r--r--  1 root  wheel        0 May 24 02:25 build.time
-rw-r--r--  1 root  wheel     1256 Jun 13 05:00 index.php

PBI MD5:
MD5 (Zsh4.3.6-PV0.pbi) = fa9f6035faf933d982192f5a6b21cdc6
MD5 (Zsh4.3.6_1-PV0.pbi) = 1a6d3e2a6780d4f540ffdcca0e3c370a


Last 30 lines of build.log
---------------------------------------------------
rm -f stamp-modobjs.tmp
echo '' builtin.o compat.o cond.o exec.o glob.o hashtable.o hist.o init.o input.o jobs.o lex.o linklist.o loop.o math.o mem.o module.o options.o params.o parse.o pattern.o prompt.o signals.o signames.o sort.o string.o subst.o text.o utils.o watch.o >> ../Src/stamp-modobjs.tmp
`stamp-modobjs' is up to date.
rm -f zsh
cc -L/usr/local/lib  -rdynamic -o zsh main.o  `cat stamp-modobjs`   -liconv -lncursesw -lm  -lc
cc -c -I. -I/usr/local/include -DHAVE_CONFIG_H -DMODULE -O2 -fno-strict-aliasing -pipe -fPIC -o curses..o curses.c
curses.c: In function `zccmd_char':
curses.c:717: error: syntax error before "cc"
curses.c:732: error: `cc' undeclared (first use in this function)
curses.c:732: error: (Each undeclared identifier is reported only once
curses.c:732: error: for each function it appears in.)
curses.c: In function `zccmd_querychar':
curses.c:1348: error: syntax error before "cc"
curses.c:1365: error: `cc' undeclared (first use in this function)
*** Error code 1

Stop in /usr/ports/shells/zsh/work/zsh-4.3.6/Src/Modules.
*** Error code 1

Stop in /usr/ports/shells/zsh/work/zsh-4.3.6/Src.
*** Error code 1

Stop in /usr/ports/shells/zsh/work/zsh-4.3.6/Src.
*** Error code 1

Stop in /usr/ports/shells/zsh/work/zsh-4.3.6.
*** Error code 1

Stop in /usr/ports/shells/zsh.
ERROR: 2.1 Build failed of zsh!!!


More information about the Pbibuild mailing list