[Pbibuild] PBI Autobuild64: synce

PCBSD Build x64 root at pbibuild.pcbsd.org
Thu Feb 28 05:01:29 PST 2008


PBI Autobuild64 results for module synce:
Status: Failed

View Folder:
ftp://69.50.233.146/pub/pbioutgoing/x64/outgoing/synce/

File listing:
-rw-r--r--  1 root  wheel  17987139 Feb 28 08:01 build.log
-rw-r--r--  1 root  wheel         0 Feb 25 17:53 build.time
-rw-r--r--  1 root  wheel      1255 Feb 28 01:14 index.php

PBI MD5:



Last 30 lines of build.log
---------------------------------------------------

** (orbit-idl-2:97595): WARNING **: ../../../include/orbit/orb-core/../../../src/orb/orb-core/orbit-interface.idl compilation failed
gmake[4]: *** [../../../include/orbit/orb-core/orbit-interface.h] Error 1
gmake[4]: Leaving directory `/usr/ports/devel/ORBit2/work/ORBit2-2.14.12/src/orb/orb-core'
gmake[3]: *** [install] Error 2
gmake[3]: Leaving directory `/usr/ports/devel/ORBit2/work/ORBit2-2.14.12/src/orb/orb-core'
gmake[2]: *** [install-recursive] Error 1
gmake[2]: Leaving directory `/usr/ports/devel/ORBit2/work/ORBit2-2.14.12/src/orb'
gmake[1]: *** [install-recursive] Error 1
gmake[1]: Leaving directory `/usr/ports/devel/ORBit2/work/ORBit2-2.14.12/src'
gmake: *** [install-recursive] Error 1
*** Error code 2

Stop in /usr/ports/devel/ORBit2.
*** Error code 1

Stop in /usr/ports/devel/py-orbit.
*** Error code 1

Stop in /usr/ports/x11-toolkits/py-gnome2.
*** Error code 1

Stop in /usr/ports/accessibility/accerciser.
*** Error code 1

Stop in /usr/ports/accessibility.
*** Error code 1

Stop in /usr/ports.
ERROR: 2.1 Build failed of synce!!!


More information about the Pbibuild mailing list