[Pbibuild] PBI Autobuild: synce

PCBSD Build Server root at pbibuild.pcbsd.org
Tue Feb 26 06:53:35 PST 2008


PBI Autobuild results for module synce:
Status: Failed

View Folder:
ftp://69.50.233.146/pub/pbioutgoing/i386/outgoing/synce/

File listing:
-rw-r--r--  1 root  wheel  17968541 Feb 26 09:53 build.log
-rw-r--r--  1 root  wheel         0 Feb 25 18:26 build.time
-rw-r--r--  1 root  wheel      1256 Feb 26 05:14 index.php

PBI MD5:



Last 30 lines of build.log
---------------------------------------------------

** (orbit-idl-2:51777): WARNING **: ../../../include/orbit/orb-core/../../../src/orb/orb-core/orbit-interface.idl compilation failed
gmake[4]: *** [../../../include/orbit/orb-core/orbit-interface.h] Error 1
gmake[4]: Leaving directory `/usr/ports/devel/ORBit2/work/ORBit2-2.14.12/src/orb/orb-core'
gmake[3]: *** [install] Error 2
gmake[3]: Leaving directory `/usr/ports/devel/ORBit2/work/ORBit2-2.14.12/src/orb/orb-core'
gmake[2]: *** [install-recursive] Error 1
gmake[2]: Leaving directory `/usr/ports/devel/ORBit2/work/ORBit2-2.14.12/src/orb'
gmake[1]: *** [install-recursive] Error 1
gmake[1]: Leaving directory `/usr/ports/devel/ORBit2/work/ORBit2-2.14.12/src'
gmake: *** [install-recursive] Error 1
*** Error code 2

Stop in /usr/ports/devel/ORBit2.
*** Error code 1

Stop in /usr/ports/devel/py-orbit.
*** Error code 1

Stop in /usr/ports/x11-toolkits/py-gnome2.
*** Error code 1

Stop in /usr/ports/accessibility/accerciser.
*** Error code 1

Stop in /usr/ports/accessibility.
*** Error code 1

Stop in /usr/ports.
ERROR: 2.1 Build failed of synce!!!


More information about the Pbibuild mailing list