[Pbibuild] PBI Autobuild64: iourbanterror

PCBSD Build x64 root at pbibuild.pcbsd.org
Sat Feb 23 22:27:10 PST 2008


PBI Autobuild64 results for module iourbanterror:
Status: Failed

View Folder:
ftp://69.50.233.146/pub/pbioutgoing/x64/outgoing/iourbanterror/

File listing:
-rw-r--r--  1 root  wheel  3811056 Feb 24 01:27 build.log
-rw-r--r--  1 root  wheel        0 Feb  3 14:18 build.time
-rw-r--r--  1 root  wheel        7 Feb 24 00:44 dirstatus
-rw-r--r--  1 root  wheel     1255 Feb 24 00:44 index.php

PBI MD5:



Last 30 lines of build.log
---------------------------------------------------
    -DDEFAULT_BASEDIR="/usr/local/share/quake3"
    -MMD
    -DNDEBUG
    -pipe
    -O3
    -ffast-math
    -funroll-loops
    -fomit-frame-pointer
    -fexpensive-optimizations

  Output:
    build/release/ioUrTded
    build/release/ioUrbanTerror
    build/release/ioUrbanTerror-smp

gmake[2]: Entering directory `/usr/ports/games/iourbanterror/work/ioUrbanTerrorClientSource'
LD build/release/ioUrTded
build/release/ded/vm.o(.text+0xeb0): In function `VM_Create':
: undefined reference to `VM_Compile'
build/release/ded/vm.o(.text+0x15c4): In function `VM_Call':
: undefined reference to `VM_CallCompiled'
gmake[2]: *** [build/release/ioUrTded] Error 1
gmake[2]: Leaving directory `/usr/ports/games/iourbanterror/work/ioUrbanTerrorClientSource'
gmake[1]: *** [targets] Error 2
gmake[1]: Leaving directory `/usr/ports/games/iourbanterror/work/ioUrbanTerrorClientSource'
gmake: *** [release] Error 2
*** Error code 2

Stop in /usr/ports/games/iourbanterror.
ERROR: 2.1 Build failed of iourbanterror!!!


More information about the Pbibuild mailing list